The NetBSD Project

CVS log for pkgsrc/devel/py-test/Makefile

[BACK] Up to [cvs.NetBSD.org] / pkgsrc / devel / py-test

Request diff between arbitrary revisions


Default branch: MAIN


Revision 1.77 / (download) - annotate - [select for diffs], Tue Apr 16 07:17:06 2019 UTC (10 days, 6 hours ago) by adam
Branch: MAIN
CVS Tags: HEAD
Changes since 1.76: +2 -2 lines
Diff to previous 1.76 (colored)

py-test: updated to 4.4.1

pytest 4.4.1:
Bug Fixes
* Environment variables are properly restored when using pytester„ŗ—‘ testdir fixture.
* Fix regression with --pdbcls, which stopped working with local modules in 4.0.0.
* Produce a warning when unknown keywords are passed to pytest.param(...).
* Invalidate import caches with monkeypatch.syspath_prepend, which is required with namespace packages being used.

Revision 1.76 / (download) - annotate - [select for diffs], Tue Apr 2 09:43:52 2019 UTC (3 weeks, 3 days ago) by adam
Branch: MAIN
Changes since 1.75: +4 -4 lines
Diff to previous 1.75 (colored)

py-test: updated to 4.4.0

pytest 4.4.0:

Features
* async test functions are skipped and a warning is emitted when a suitable async plugin is not installed (such as pytest-asyncio or pytest-trio).
Previously async functions would not execute at all but still be marked as „ŗ◊—assed„ŗ

* Include new disable_test_id_escaping_and_forfeit_all_rights_to_community_support option to disable ascii-escaping in parametrized values. This may cause a series of problems and as the name makes clear, use at your own risk.
* The -p option can now be used to early-load plugins also by entry-point name, instead of just by module name.
This makes it possible to early load external plugins like pytest-cov in the command-line:
pytest -p pytest_cov

* The --pdbcls option handles classes via module attributes now (e.g. pdb:pdb.Pdb with pdb++), and its validation was improved.
* The testpaths configuration option is now displayed next to the rootdir and inifile lines in the pytest header if the option is in effect, i.e., directories or file names were not explicitly passed in the command line.
Also, inifile is only displayed if there„ŗ—‘ a configuration file, instead of an empty inifile: string.

* Doctests can be skipped now dynamically using pytest.skip().
* Internal refactorings have been made in order to make the implementation of the pytest-subtests plugin possible, which adds unittest sub-test support and a new subtests fixture as discussed in 1367.
For details on the internal refactorings, please see the details on the related PR.

* pytester„ŗ—‘ LineMatcher asserts that the passed lines are a sequence.
* Handle -p plug after -p no:plug.
This can be used to override a blocked plugin (e.g. in „ŗ◊¬ddopts„ŗ from the command line etc.

* Output capturing is handled correctly when only capturing via fixtures (capsys, capfs) with pdb.set_trace().
* pytester sets $HOME and $USERPROFILE to the temporary directory during test runs.
This ensures to not load configuration files from the real user„ŗ—‘ home directory.

* Namespace packages are handled better with monkeypatch.syspath_prepend and testdir.syspathinsert (via pkg_resources.fixup_namespace_packages).
* The stepwise plugin reports status information now.
* If a setup.cfg file contains [tool:pytest] and also the no longer supported [pytest] section, pytest will use [tool:pytest] ignoring [pytest]. Previously it would unconditionally error out.
This makes it simpler for plugins to support old pytest versions.

Bug Fixes
* Fix bug where fixtures requested dynamically via request.getfixturevalue() might be teardown before the requesting fixture.
* pytester unsets PYTEST_ADDOPTS now to not use outer options with testdir.runpytest().
* Use the correct modified time for years after 2038 in rewritten .pyc files.
* Fix line offsets with ScopeMismatch errors.
* -p no:plugin is handled correctly for default (internal) plugins now, e.g. with -p no:capture.
Previously they were loaded (imported) always, making e.g. the capfd fixture available.

* The pdb quit command is handled properly when used after the debug command with pdb++.
* Fix the interpretation of -qq option where it was being considered as -v instead.
* outcomes.Exit is not swallowed in assertrepr_compare anymore.
* Close logging„ŗ—‘ file handler explicitly when the session finishes.
* Fix line offset with mark collection error (off by one).

Improved Documentation
* Update docs for pytest_cmdline_parse hook to note availability liminations
Trivial/Internal Changes
* pluggy>=0.9 is now required.
* funcsigs>=1.0 is now required for Python 2.7.
* Some left-over internal code related to yield tests has been removed.
* Remove internally unused anypython fixture from the pytester plugin.
* Remove deprecated Sphinx directive, add_description_unit(), pin sphinx-removed-in to >= 0.2.0 to support Sphinx 2.0.
* Fix pytest tests invocation with custom PYTHONPATH.
* New pytest_report_to_serializable and pytest_report_from_serializable experimental hooks.
These hooks will be used by pytest-xdist, pytest-subtests, and the replacement for resultlog to serialize and customize reports.
They are experimental, meaning that their details might change or even be removed completely in future patch releases without warning.

Feedback is welcome from plugin authors and users alike.

* Collector.repr_failure respects the --tb option, but only defaults to short now (with auto).

Revision 1.75 / (download) - annotate - [select for diffs], Wed Mar 13 08:54:21 2019 UTC (6 weeks, 2 days ago) by adam
Branch: MAIN
CVS Tags: pkgsrc-2019Q1-base, pkgsrc-2019Q1
Changes since 1.74: +2 -2 lines
Diff to previous 1.74 (colored)

py-test: updated to 4.3.1

pytest 4.3.1:

Bug Fixes
- Logging messages inside pytest_runtest_logreport() are now properly captured and displayed.
- Improve validation of contents written to captured output so it behaves the same as when capture is disabled.
- Fix AttributeError: FixtureRequest has no 'confg' attribute bug in testdir.copy_example.

Trivial/Internal Changes
- Avoid pkg_resources import at the top-level.

Revision 1.74 / (download) - annotate - [select for diffs], Tue Feb 19 08:25:49 2019 UTC (2 months ago) by adam
Branch: MAIN
Changes since 1.73: +4 -2 lines
Diff to previous 1.73 (colored)

py-test: updated to 4.3.0

pytest 4.3.0:

Deprecations
* pytest.warns() now emits a warning when it receives unknown keyword arguments.

This will be changed into an error in the future.

Features
* Usage errors from argparse are mapped to pytest„ŗ—‘ UsageError.

* Add the --ignore-glob parameter to exclude test-modules with Unix shell-style wildcards. Add the collect_ignore_glob for conftest.py to exclude test-modules with Unix shell-style wildcards.

* The warning about Python 2.7 and 3.4 not being supported in pytest 5.0 has been removed.

In the end it was considered to be more of a nuisance than actual utility and users of those Python versions shouldn„ŗ—’ have problems as pip will not install pytest 5.0 on those interpreters.

* With the help of new set_log_path() method there is a way to set log_file paths from hooks.

Bug Fixes
* --help and --version are handled with UsageError.
* Fix AssertionError with collection of broken symlinks with packages.

Revision 1.73 / (download) - annotate - [select for diffs], Wed Feb 13 15:40:53 2019 UTC (2 months, 1 week ago) by adam
Branch: MAIN
Changes since 1.72: +2 -2 lines
Diff to previous 1.72 (colored)

py-test: updated to 4.2.1

pytest 4.2.1:

Bug Fixes
- The pytest_report_collectionfinish hook now is also called with --collect-only.
- Do not raise UsageError when an imported package has a pytest_plugins.py child module.
- Fix output capturing when using pdb++ with recursive debugging.
- Fix handling of collect_ignore via parent conftest.py.
- Fix regression where setUpClass would always be called in subclasses even if all tests
  were skipped by a unittest.skip() decorator applied in the subclass.
- Fix parametrize(... ids=<function>) when the function returns non-strings.
- Fix/improve collection of args when passing in __init__.py and a test file.
- more_itertools is now constrained to <6.0.0 when required for Python 2.7 compatibility.
- Fix "ValueError: Plugin already registered" exceptions when running in build directories that symlink to actual source.

Improved Documentation
- Add note to plugins.rst that pytest_plugins should not be used as a name for a user module containing plugins.
- Document how to use raises and does_not_raise to write parametrized tests with conditional raises.
- Document how to customize test failure messages when using
  pytest.warns.

Trivial/Internal Changes
- Some verbosity related attributes of the TerminalReporter plugin are now
  read only properties.

Revision 1.72 / (download) - annotate - [select for diffs], Sun Feb 3 11:07:39 2019 UTC (2 months, 3 weeks ago) by leot
Branch: MAIN
Changes since 1.71: +1 -3 lines
Diff to previous 1.71 (colored)

py-test: Remove not needed REPLACE_PYTHON (file no longer exists)

Revision 1.71 / (download) - annotate - [select for diffs], Fri Feb 1 11:52:22 2019 UTC (2 months, 3 weeks ago) by adam
Branch: MAIN
Changes since 1.70: +2 -2 lines
Diff to previous 1.70 (colored)

py-test: updated to 4.2.0

pytest 4.2.0:

Features
* Class xunit-style functions and methods now obey the scope of autouse fixtures.
This fixes a number of surprising issues like setup_method being called before session-scoped autouse fixtures.

* Display a message at the end of the test session when running under Python 2.7 and 3.4 that pytest 5.0 will no longer support those Python versions.
* The number of selected tests now are also displayed when the -k or -m flags are used.
* pytest_report_teststatus hook now can also receive a config parameter.
* pytest_terminal_summary hook now can also receive a config parameter.

Bug Fixes
* --junitxml can emit XML compatible with Jenkins xUnit. junit_family INI option accepts legacy|xunit1, which produces old style output, and xunit2 that conforms more strictly to https://github.com/jenkinsci/xunit-plugin/blob/xunit-2.3.2/src/main/resources/org/jenkinsci/plugins/xunit/types/model/xsd/junit-10.xsd
* Improve quitting from pdb, especially with --trace.
Using q[quit] after pdb.set_trace() will quit pytest also.

* Warning summary now groups warnings by message instead of by test id.
This makes the output more compact and better conveys the general idea of how much code is actually generating warnings, instead of how many tests call that code.

* monkeypatch.delattr handles class descriptors like staticmethod/classmethod.
* Restore marks being considered keywords for keyword expressions.
* tmp_path fixture and other related ones provides resolved path (a.k.a real path)
* pytest_terminal_summary uses result from pytest_report_teststatus hook, rather than hardcoded strings.
* Correctly handle unittest.SkipTest exception containing non-ascii characters on Python 2.
* Ensure the tmpdir and the tmp_path fixtures are the same folder.
* Ensure tmp_path is always a real path.

Trivial/Internal Changes
* Use a.item() instead of the deprecated np.asscalar(a) in pytest.approx.
np.asscalar has been deprecated in numpy 1.16..

* Copy saferepr from pylib

Revision 1.70 / (download) - annotate - [select for diffs], Sun Jan 13 17:45:33 2019 UTC (3 months, 1 week ago) by adam
Branch: MAIN
Changes since 1.69: +2 -2 lines
Diff to previous 1.69 (colored)

py-test: updated to 4.1.1

pytest 4.1.1:
Bug Fixes
* Show full repr with assert a==b and -vv.
* Extend Doctest-modules to ignore mock objects.
* Fixed pytest.warns bug when context manager is reused (e.g. multiple parametrization).
* Don„ŗ—’ rewrite assertion when __getattr__ is broken

Revision 1.69 / (download) - annotate - [select for diffs], Mon Jan 7 08:38:01 2019 UTC (3 months, 2 weeks ago) by adam
Branch: MAIN
Changes since 1.68: +2 -2 lines
Diff to previous 1.68 (colored)

py-test: updated to 4.1.0

pytest 4.1.0:
Removals
* pytest.mark.parametrize: in previous versions, errors raised by id functions were suppressed and changed into warnings. Now the exceptions are propagated, along with a pytest message informing the node, parameter value and index where the exception occurred.
* Remove legacy internal warnings system: config.warn, Node.warn. The pytest_logwarning now issues a warning when implemented.
See our docs on information on how to update your code.
* Removed support for yield tests - they are fundamentally broken because they don„ŗ—’ support fixtures properly since collection and test execution were separated.
See our docs on information on how to update your code.
* Removed support for applying marks directly to values in @pytest.mark.parametrize. Use pytest.param instead.
See our docs on information on how to update your code.
* Removed Metafunc.addcall. This was the predecessor mechanism to @pytest.mark.parametrize.
See our docs on information on how to update your code.
* Removed support for passing strings to pytest.main. Now, always pass a list of strings instead.
See our docs on information on how to update your code.
* [pytest] section in setup.cfg files is not longer supported, use [tool:pytest] instead. setup.cfg files are meant for use with distutils, and a section named pytest has notoriously been a source of conflicts and bugs.
Note that for pytest.ini and tox.ini files the section remains [pytest].
* Removed the deprecated compat properties for node.Class/Function/Module - use pytest.Class/Function/Module now.
See our docs on information on how to update your code.
* Removed the implementation of the pytest_namespace hook.
See our docs on information on how to update your code.
* Removed request.cached_setup. This was the predecessor mechanism to modern fixtures.
See our docs on information on how to update your code.
* Removed the deprecated PyCollector.makeitem method. This method was made public by mistake a long time ago.
* Removed support to define fixtures using the pytest_funcarg__ prefix. Use the @pytest.fixture decorator instead.
See our docs on information on how to update your code.
* Calling fixtures directly is now always an error instead of a warning.
See our docs on information on how to update your code.
* Remove Node.get_marker(name) the return value was not usable for more than a existence check.
Use Node.get_closest_marker(name) as a replacement.
* The deprecated record_xml_property fixture has been removed, use the more generic record_property instead.
See our docs for more information.
* An error is now raised if the pytest_plugins variable is defined in a non-top-level conftest.py file (i.e., not residing in the rootdir).
See our docs for more information.
* Remove testfunction.markername attributes - use Node.iter_markers(name=None) to iterate them.

Deprecations
* Deprecated the pytest.config global.
See https://docs.pytest.org/en/latest/deprecations.html#pytest-config-global for rationale.
* Passing the message parameter of pytest.raises now issues a DeprecationWarning.
It is a common mistake to think this parameter will match the exception message, while in fact it only serves to provide a custom message in case the pytest.raises check fails. To avoid this mistake and because it is believed to be little used, pytest is deprecating it without providing an alternative for the moment.
If you have concerns about this, please comment on issue 3974.
* Deprecated raises(..., 'code(as_a_string)') and warns(..., 'code(as_a_string)').
See https://docs.pytest.org/en/latest/deprecations.html#raises-warns-exec for rationale and examples.

Features
* A warning is now issued when assertions are made for None.
This is a common source of confusion among new users, which write:
assert mocked_object.assert_called_with(3, 4, 5, key="value")
When they should write:
mocked_object.assert_called_with(3, 4, 5, key="value")
Because the assert_called_with method of mock objects already executes an assertion.
This warning will not be issued when None is explicitly checked. An assertion like:
assert variable is None
will not issue the warning.
* Richer equality comparison introspection on AssertionError for objects created using attrs or dataclasses (Python 3.7+, backported to 3.6).
* CACHEDIR.TAG files are now created inside cache directories.
Those files are part of the Cache Directory Tagging Standard, and can be used by backup or synchronization programs to identify pytest„ŗ—‘ cache directory as such.
* pytest.outcomes.Exit is derived from SystemExit instead of KeyboardInterrupt. This allows us to better handle pdb exiting.
* Updated the --collect-only option to display test descriptions when ran using --verbose.
* Restructured ExceptionInfo object construction and ensure incomplete instances have a repr/str.
* pdb: added support for keyword arguments with pdb.set_trace.
It handles header similar to Python 3.7 does it, and forwards any other keyword arguments to the Pdb constructor.
This allows for __import__("pdb").set_trace(skip=["foo.*"]).
* Added ini parameter junit_duration_report to optionally report test call durations, excluding setup and teardown times.
The JUnit XML specification and the default pytest behavior is to include setup and teardown times in the test duration report. You can include just the call durations instead (excluding setup and teardown) by adding this to your pytest.ini file:
[pytest]
junit_duration_report = call
* -ra now will show errors and failures last, instead of as the first items in the summary.
This makes it easier to obtain a list of errors and failures to run tests selectively.
* pytest.importorskip now supports a reason parameter, which will be shown when the requested module cannot be imported.

Bug Fixes
* -p now accepts its argument without a space between the value, for example -pmyplugin.
* approx again works with more generic containers, more precisely instances of Iterable and Sized instead of more restrictive Sequence.
* Ensure that node ids are printable.
* Fixed raises(..., 'code(string)') frame filename.
* Display actual test ids in --collect-only.

Improved Documentation
* Markers example documentation page updated to support latest pytest version.
* Update cache documentation example to correctly show cache hit and miss.
* Improved detailed summary report documentation.

Trivial/Internal Changes
* Changed the deprecation type of --result-log to PytestDeprecationWarning.

Revision 1.68 / (download) - annotate - [select for diffs], Fri Dec 14 14:44:21 2018 UTC (4 months, 1 week ago) by adam
Branch: MAIN
CVS Tags: pkgsrc-2018Q4-base, pkgsrc-2018Q4
Changes since 1.67: +2 -3 lines
Diff to previous 1.67 (colored)

py-test: updated to 4.0.2

pytest 4.0.2:

Bug Fixes
- Validate arguments from the PYTEST_ADDOPTS environment variable and the addopts ini option separately.
- Fix raises(..., 'code(string)') frame filename.
- When a fixture yields and a log call is made after the test runs, and, if the test is interrupted, capture attributes are None.
- Raise TypeError for with raises(..., match=<non-None falsey value>).

Revision 1.67 / (download) - annotate - [select for diffs], Mon Dec 10 23:59:20 2018 UTC (4 months, 2 weeks ago) by leot
Branch: MAIN
Changes since 1.66: +4 -2 lines
Diff to previous 1.66 (colored)

py-test: pathlib2 is needed by py27-test too

Due the if-elif condition pathlib2 was accidentally not marked as dependency
in the py27 case.

Revision 1.66 / (download) - annotate - [select for diffs], Sat Nov 24 15:35:13 2018 UTC (5 months ago) by adam
Branch: MAIN
Changes since 1.65: +5 -4 lines
Diff to previous 1.65 (colored)

py-test: updated to 4.0.1

pytest 4.0.1:

Bug Fixes
- Display warnings before "short test summary info" again, but still later warnings in the end.
- Handle uninitialized exceptioninfo in repr/str.
- Do not create .gitignore/README.md files in existing cache directories.
- Rearrange warning handling for the yield test errors so the opt-out in 4.0.x correctly works.
- Fix collection of testpaths with --pyargs.
- Fix assertion rewriting involving Starred + side-effects.
- Ensure we resolve the absolute path when the given --basetemp is a relative path.

- Use pkg_resources.parse_version instead of LooseVersion in minversion check.
- Adjust the stack level of some internal pytest warnings.

Revision 1.65 / (download) - annotate - [select for diffs], Sun Nov 11 21:56:21 2018 UTC (5 months, 1 week ago) by adam
Branch: MAIN
Changes since 1.64: +2 -2 lines
Diff to previous 1.64 (colored)

py-test: updated to 3.10.1

pytest 3.10.1:

Bug Fixes
- Fix nested usage of debugging plugin (pdb), e.g. with pytester's testdir.runpytest.
- Block the stepwise plugin if cacheprovider is also blocked, as one depends on the other.
- Parse minversion as an actual version and not as dot-separated strings.
- Fix duplicate collection due to multiple args matching the same packages.
- Fix item.nodeid with resolved symlinks.
- Fix collection of direct symlinked files, where the target does not match python_files.
- Fix TypeError in report_collect with _collect_report_last_write.

Trivial/Internal Changes
- Replace byte/unicode helpers in test_capture with python level syntax.

Revision 1.64 / (download) - annotate - [select for diffs], Mon Nov 5 08:36:25 2018 UTC (5 months, 2 weeks ago) by adam
Branch: MAIN
Changes since 1.63: +2 -2 lines
Diff to previous 1.63 (colored)

py-test: updated to 3.10.0

pytest 3.10.0:

Features
* Resume capturing output after continue with __import__("pdb").set_trace().
  This also adds a new pytest_leave_pdb hook, and passes in pdb to the existing pytest_enter_pdb hook.
* Add -sw, --stepwise as an alternative to --lf -x for stopping at the first failure, but starting the next test invocation from that test. See the documentation for more info.
* Make --color emit colorful dots when not running in verbose mode. Earlier, it would only colorize the test-by-test output if --verbose was also passed.
* Improve performance with collection reporting in non-quiet mode with terminals.
  The „ŗ◊ńollecting „ŗ¶‚ message is only printed/updated every 0.5s.

Bug Fixes
* Fix false RemovedInPytest4Warning: usage of Session... is deprecated, please use pytest warnings.
* Fix problems with running tests in package __init__.py files.
* Swallow warnings during anonymous compilation of source.
* Fix access denied error when deleting stale directories created by tmpdir / tmp_path.
* Naming a fixture request will now raise a warning: the request fixture is internal and should not be overwritten as it will lead to internal errors.
* Handle (ignore) exceptions raised during collection, e.g. with Django„ŗ—‘ LazySettings proxy class.

Improved Documentation
* Added missing documentation about the fact that module names passed to filter warnings are not regex-escaped.

Trivial/Internal Changes
* Display cachedir also in non-verbose mode if non-default.
* pdb: improve message about output capturing with set_trace.
  Do not display „ŗ◊™O-capturing turned off/on„ŗwhen -s is used to avoid confusion.
* Improve message and stack level of warnings issued by monkeypatch.setenv when the value of the environment variable is not a str.

Revision 1.63 / (download) - annotate - [select for diffs], Mon Oct 29 08:25:08 2018 UTC (5 months, 3 weeks ago) by adam
Branch: MAIN
Changes since 1.62: +2 -2 lines
Diff to previous 1.62 (colored)

py-test: updated to 3.9.3

pytest 3.9.3:
Bug Fixes
* Fix „ŗ◊∑alueError: Plugin already registered„ŗwith conftest plugins via symlink.
* Handle race condition between creation and deletion of temporary folders.
* Fix bug where the warning summary at the end of the test session was not showing the test where the warning was originated.
* Fix regression when stacklevel for warnings was passed as positional argument on python2.

Improved Documentation
* Add reference to empty_parameter_set_mark ini option in documentation of @pytest.mark.parametrize

Trivial/Internal Changes
* Revert patching of sys.breakpointhook since it appears to do nothing.
* Apply an import sorter (reorder-python-imports) to the codebase.
* Remove use of unnecessary compat shim, six.binary_type

Revision 1.62 / (download) - annotate - [select for diffs], Tue Oct 23 06:34:00 2018 UTC (6 months ago) by adam
Branch: MAIN
Changes since 1.61: +2 -2 lines
Diff to previous 1.61 (colored)

py-test: updated to 3.9.2

pytest 3.9.2:

Bug Fixes
* Improve error message when a recursive dependency between fixtures is detected.
* Fix logging messages not shown in hooks pytest_sessionstart() and pytest_sessionfinish().
* Fix unescaped XML raw objects in JUnit report for skipped tests
* Python 2: safely format warning message about passing unicode strings to warnings.warn, which may cause surprising MemoryError exception when monkey patching warnings.warn itself.
* Improve error message when it is not possible to determine a function„ŗ—‘ signature.
* Pin setuptools>=40.0 to support py_modules in setup.cfg
* Restore the tmpdir behaviour of symlinking the current test run.
* Fix filename reported by warnings.warn when using recwarn under python2.

Revision 1.61 / (download) - annotate - [select for diffs], Thu Oct 18 10:11:25 2018 UTC (6 months, 1 week ago) by adam
Branch: MAIN
Changes since 1.60: +2 -2 lines
Diff to previous 1.60 (colored)

py-test: updated to 3.9.1

pytest 3.9.1:
Features
- For test-suites containing test classes, the information about the subclassed module is now output only if a higher verbosity level is specified (at least „ŗvv„ŗ.

pytest 3.9.0:
Deprecations
- The following accesses have been documented as deprecated for years, but are now actually emitting deprecation warnings.
Access of Module, Function, Class, Instance, File and Item through Node instances. Now users will this warning:
usage of Function.Module is deprecated, please use pytest.Module instead
Users should just import pytest and access those objects using the pytest module.
request.cached_setup, this was the precursor of the setup/teardown mechanism available to fixtures. You can consult funcarg comparison section in the docs.
Using objects named "Class" as a way to customize the type of nodes that are collected in Collector subclasses has been deprecated. Users instead should use pytest_collect_make_item to customize node types during collection.
This issue should affect only advanced plugins who create new collection types, so if you see this warning message please contact the authors so they can change the code.
The warning that produces the message below has changed to RemovedInPytest4Warning:
getfuncargvalue is deprecated, use getfixturevalue
- Add a Deprecation warning for pytest.ensuretemp as it was deprecated since a while.

Features
- Improve usage errors messages by hiding internal details which can be distracting and noisy.
This has the side effect that some error conditions that previously raised generic errors (such as ValueError for unregistered marks) are now raising Failed exceptions.
- Improve the error displayed when a conftest.py file could not be imported.
In order to implement this, a new chain parameter was added to ExceptionInfo.getrepr to show or hide chained tracebacks in Python 3 (defaults to True).
- Add empty_parameter_set_mark=fail_at_collect ini option for raising an exception when parametrize collects an empty set.
- Log messages generated in the collection phase are shown when live-logging is enabled and/or when they are logged to a file.
- Introduce tmp_path as a fixture providing a Path object.
- Deprecation warnings are now shown even if you customize the warnings filters yourself. In the previous version any customization would override pytest„ŗ—‘ filters and deprecation warnings would fall back to being hidden by default.
- Allow specification of timeout for Testdir.runpytest_subprocess() and Testdir.run().
- Add returncode argument to pytest.exit() to exit pytest with a specific return code.
- Reimplement pytest.deprecated_call using pytest.warns so it supports the match='...' keyword argument.
This has the side effect that pytest.deprecated_call now raises pytest.fail.Exception instead of AssertionError.
- Require setuptools>=30.3 and move most of the metadata to setup.cfg.

Bug Fixes
- Improve error message when test functions of unittest.TestCase subclasses use a parametrized fixture.
- request.fixturenames now correctly returns the name of fixtures created by request.getfixturevalue().
- Warning filters passed as command line options using -W now take precedence over filters defined in ini configuration files.
- Fix source reindenting by using textwrap.dedent directly.
- pytest.warn will capture previously-warned warnings in Python 2. Previously they were never raised.
- Resolve symbolic links for args.
This fixes running pytest tests/test_foo.py::test_bar, where tests is a symlink to project/app/tests: previously project/app/conftest.py would be ignored for fixtures then.
- Fix duplicate printing of internal errors when using --pdb.
- pathlib based tmpdir cleanup now correctly handles symlinks in the folder.
- Display the filename when encountering SyntaxWarning.

Improved Documentation
- Update usefixtures documentation to clarify that it can„ŗ—’ be used with fixture functions.
- Update fixture documentation to specify that a fixture can be invoked twice in the scope it„ŗ—‘ defined for.
- According to unittest.rst, setUpModule and tearDownModule were not implemented, but it turns out they are. So updated the documentation for unittest.
- Add tempir testing example to CONTRIBUTING.rst guide
Trivial/Internal Changes
- The internal MarkerError exception has been removed.
- Port the implementation of tmpdir to pathlib.
- Exclude 0.00 second entries from --duration output unless -vv is passed on the command-line.
- Fixed formatting of string literals in internal tests.

Revision 1.60 / (download) - annotate - [select for diffs], Wed Oct 3 09:58:11 2018 UTC (6 months, 3 weeks ago) by adam
Branch: MAIN
Changes since 1.59: +2 -2 lines
Diff to previous 1.59 (colored)

py-test: updated to 3.8.2

pytest 3.8.2:

Deprecations and Removals
* The item parameter of pytest_warning_captured hook is now documented as deprecated. We realized only after the 3.8 release that this parameter is incompatible with pytest-xdist.

Our policy is to not deprecate features during bugfix releases, but in this case we believe it makes sense as we are only documenting it as deprecated, without issuing warnings which might potentially break test suites. This will get the word out that hook implementers should not use this parameter at all.

In a future release item will always be None and will emit a proper warning when a hook implementation makes use of it.

Bug Fixes
* Fix reload on assertion rewritten modules.
* The .user_properties attribute of TestReport objects is a list of (name, value) tuples, but could sometimes be instantiated as a tuple of tuples. It is now always a list.
* No longer issue warnings about using pytest_plugins in non-top-level directories when using --pyargs: the current --pyargs mechanism is not reliable and might give false negatives.
* Exclude empty reports for passed tests when -rP option is used.
* Improve error message when an invalid Python expression is passed to the -m option.
* MonkeyPatch.setenv and MonkeyPatch.delenv issue a warning if the environment variable name is not str on Python 2.

In Python 2, adding unicode keys to os.environ causes problems with subprocess (and possible other modules), making this a subtle bug specially susceptible when used with from __future__ import unicode_literals.

Improved Documentation
* Add possible values for fixture scope to docs.

Revision 1.59 / (download) - annotate - [select for diffs], Mon Sep 24 08:06:29 2018 UTC (7 months ago) by adam
Branch: MAIN
CVS Tags: pkgsrc-2018Q3-base, pkgsrc-2018Q3
Changes since 1.58: +2 -2 lines
Diff to previous 1.58 (colored)

py-test: updated to 3.8.1

pytest 3.8.1:

Bug Fixes
* .pytest_cache directory is now automatically ignored by Git. Users who would like to contribute a solution for other SCMs please consult/comment on this issue.
* Fix the following error during collection of tests inside packages:
  TypeError: object of type 'Package' has no len()
* Fix bug where indirect parametrization would consider the scope of all fixtures used by the test function to determine the parametrization scope, and not only the scope of the fixtures being parametrized.
* Fix crash of the assertion rewriter if a test changed the current working directory without restoring it afterwards.
* Fix issue that prevented some caplog properties (for example record_tuples) from being available when entering the debugger with --pdb.
* Fix UnicodeDecodeError in python2.x when a class returns a non-ascii binary __repr__ in an assertion which also contains non-ascii text.

Improved Documentation
* New Deprecations and Removals page shows all currently deprecated features, the rationale to do so, and alternatives to update your code. It also list features removed from pytest in past major releases to help those with ancient pytest versions to upgrade.

Trivial/Internal Changes
* Improve pre-commit detection for changelog filenames
* Remove legacy code around im_func as that was python2 only

Revision 1.58 / (download) - annotate - [select for diffs], Fri Sep 7 08:55:43 2018 UTC (7 months, 2 weeks ago) by adam
Branch: MAIN
Changes since 1.57: +2 -2 lines
Diff to previous 1.57 (colored)

py-test: updated to 3.8.0

pytest 3.8.0:

Deprecations and Removals
- Config.warn has been deprecated, it should be replaced by calls to the standard warnings.warn.
  Node.warn now supports two signatures:
  * node.warn(PytestWarning("some message")): is now the recommended way to call this function. The warning
    instance must be a PytestWarning or subclass  instance.
  * node.warn("CI", "some message"): this code/message form is now deprecated and should be converted to
    the warning instance form above.
  RemovedInPytest4Warning and PytestExperimentalApiWarning are now part of the public API and should be accessed
  using pytest.RemovedInPytest4Warning and pytest.PytestExperimentalApiWarning.
- @pytest.mark.filterwarnings second parameter is no longer regex-escaped,
  making it possible to actually use regular expressions to check the warning message.
  **Note**: regex-escaping the match string was an implementation oversight that might break test suites which depend
  on the old behavior.

Features
- Internal pytest warnings are now issued using the standard warnings module, making it possible to use
  the standard warnings filters to manage those warnings. This introduces PytestWarning,
  PytestDeprecationWarning and RemovedInPytest4Warning warning types as part of the public API.
- DeprecationWarning and PendingDeprecationWarning are now shown by default if no other warning filter is
  configured.
- Add option to disable plugin auto-loading.
- Added the count option to console_output_style to enable displaying the progress as a count instead of a percentage.
- Added support for 'xfailed' and 'xpassed' outcomes to the pytester.RunResult.assert_outcomes signature.
- Terminal writer now takes into account unicode character width when writing out progress.
- Pytest now returns with correct exit code (EXIT_USAGEERROR, 4) when called with unknown arguments.
- Improve performance of assertion rewriting.

- Added a blurb in usage.rst for the usage of -r flag which is used to show an extra test summary info.
- Corrected type of the exceptions collection passed to xfail: raises argument accepts a tuple instead of list.

Trivial/Internal Changes
- Removed "run all (no recorded failures)" message printed with --failed-first and --last-failed when there are no failed tests.

Revision 1.57 / (download) - annotate - [select for diffs], Thu Aug 30 10:04:44 2018 UTC (7 months, 3 weeks ago) by adam
Branch: MAIN
Changes since 1.56: +2 -2 lines
Diff to previous 1.56 (colored)

py-test: updated to 3.7.4

pytest 3.7.4:

Bug Fixes
- Fix possible infinite recursion when writing .pyc files.
- Cache plugin now obeys the -q flag when --last-failed and --failed-first flags are used.
- Fix bad console output when using console_output_style=classic.
- Fix macOS specific code using capturemanager plugin in doctests.

Revision 1.56 / (download) - annotate - [select for diffs], Tue Aug 28 09:52:53 2018 UTC (7 months, 4 weeks ago) by adam
Branch: MAIN
Changes since 1.55: +4 -2 lines
Diff to previous 1.55 (colored)

py-test: DEPEND on py-pathlib2 for Python < 3.6

Revision 1.55 / (download) - annotate - [select for diffs], Mon Aug 27 06:06:02 2018 UTC (7 months, 4 weeks ago) by adam
Branch: MAIN
Changes since 1.54: +2 -2 lines
Diff to previous 1.54 (colored)

py-test: updated to 3.7.3

pytest 3.7.3:

Bug Fixes
* Fixtures during teardown can again use capsys and capfd to inspect output captured during tests.
* Fix collection of tests from __init__.py files if they match the python_files configuration option.
* Fix issue where teardown of fixtures of consecutive sub-packages were executed once, at the end of the outer package.
* Fix bug where --show-capture=no option would still show logs printed during fixture teardown.
* Fix stdout/stderr not getting captured when real-time cli logging is active.
* Fix collection error when specifying test functions directly in the command line using test.py::test syntax together with --doctest-modules.
* Fix bugs where unicode arguments could not be passed to testdir.runpytest on Python 2.
* Fix double collection of tests within packages when the filename starts with a capital letter.

Revision 1.54 / (download) - annotate - [select for diffs], Sun Aug 19 08:12:20 2018 UTC (8 months ago) by adam
Branch: MAIN
Changes since 1.53: +5 -2 lines
Diff to previous 1.53 (colored)

py-test: updated to 3.7.2

pytest 3.7.2:

Bug Fixes
- Fix filterwarnings not being registered as a builtin mark.
- Fix test collection from packages mixed with normal directories.
- Fix infinite recursion during collection if a pytest_ignore_collect hook returns False instead of None.
- Fix bug where decorated fixtures would lose functionality (for example @mock.patch).
- Fix bug where importing modules or other objects with prefix pytest_ prefix would raise a PluginValidationError.
- Fix AttributeError during teardown of TestCase subclasses which raise an exception during __init__.
- Fix traceback reporting for exceptions with __cause__ cycles.

Revision 1.53 / (download) - annotate - [select for diffs], Sun Aug 5 10:27:30 2018 UTC (8 months, 2 weeks ago) by adam
Branch: MAIN
Changes since 1.52: +2 -2 lines
Diff to previous 1.52 (colored)

py-test: bump py-pluggy DEPENDS

Revision 1.52 / (download) - annotate - [select for diffs], Sun Aug 5 10:17:47 2018 UTC (8 months, 2 weeks ago) by adam
Branch: MAIN
Changes since 1.51: +3 -3 lines
Diff to previous 1.51 (colored)

py-test: updated to 3.7.1

pytest 3.7.1:

Bug Fixes
- Raise immediately if approx() is given an expected value of a type it doesn't understand (e.g. strings, nested dicts, etc.).
- Correctly represent the dimensions of an numpy array when calling repr() on approx().
- Display the absolute path if cache_dir is not relative to the rootdir instead of failing.
- Fix compatibility problem with plugins and the warning code issued by fixture functions when they are called directly.
- Fix infinite recursion in pytest.approx with arrays in numpy<1.13.
- Pin pathlib2 to >=2.2.0 as we require __fspath__ support.
- Fix TypeError when the assertion message is bytes in python 3.


pytest 3.7.0:

Deprecations and Removals
- pytest_namespace has been deprecated.
  See the documentation for pytest_namespace hook for suggestions on how to deal
  with this in plugins which use this functionality.
- Calling a fixture function directly, as opposed to request them in a test function, now issues a RemovedInPytest4Warning. It will be changed into an error in pytest 4.0.
  This is a great source of confusion to new users, which will often call the fixture functions and request them from test functions interchangeably, which breaks the fixture resolution model.

Features
- New package fixture scope: fixtures are finalized when the last test of a *package* finishes. This feature is considered **experimental**, so use it sparingly.
- Node.add_marker now supports an append=True/False parameter to determine whether the mark comes last (default) or first.
- Fixture caplog now has a messages property, providing convenient access to the format-interpolated log messages without the extra data provided by the formatter/handler.
- New --trace option to enter the debugger at the start of a test.
- Introduce pytester.copy_example as helper to do acceptance tests against examples from the project.

Bug Fixes
- Fix a bug where fixtures overridden by direct parameters (for example parametrization) were being instantiated even if they were not being used by a test.
- Fix ApproxNumpy initialisation argument mixup, abs and rel tolerances were flipped causing strange comparsion results.
  Add tests to check abs and rel tolerances for np.array and test for expecting nan with np.array()
- Fix truncated locals output in verbose mode.

Improved Documentation
- Correct the usage documentation of --last-failed-no-failures by adding the missing --last-failed argument in the presented examples, because they are misleading and lead to think that the missing argument is not needed.

Trivial/Internal Changes
- Now a README.md file is created in .pytest_cache to make it clear why the directory exists.

Revision 1.51 / (download) - annotate - [select for diffs], Thu Jul 5 06:48:20 2018 UTC (9 months, 3 weeks ago) by adam
Branch: MAIN
Changes since 1.50: +2 -2 lines
Diff to previous 1.50 (colored)

py-test: updated to 3.6.3

3.6.3:
Bug Fixes
* Fix ImportWarning triggered by explicit relative imports in assertion-rewritten package modules.
* Fix error in pytest.approx when dealing with 0-dimension numpy arrays.
* No longer raise ValueError when using the get_marker API.
* Fix problem where log messages with non-ascii characters would not appear in the output log file.
* No longer raise AttributeError when legacy marks can„ŗ—’ be stored in functions.

Improved Documentation
* The description above the example for @pytest.mark.skipif now better matches the code.

Trivial/Internal Changes
* Internal refactoring: removed unused CallSpec2tox ._globalid_args attribute and metafunc parameter from CallSpec2.copy().
* Silence usage of reduce warning in Python 2
* Fix usage of attr.ib deprecated convert parameter

Revision 1.50 / (download) - annotate - [select for diffs], Thu Jun 21 06:41:14 2018 UTC (10 months ago) by adam
Branch: MAIN
CVS Tags: pkgsrc-2018Q2-base, pkgsrc-2018Q2
Changes since 1.49: +3 -3 lines
Diff to previous 1.49 (colored)

py-test: updated to 3.6.2

Pytest 3.6.2:

Bug Fixes
Fix regression in Node.add_marker by extracting the mark object of a MarkDecorator.
Warnings without location were reported as None. This is corrected to now report <undetermined location>.
Continue to call finalizers in the stack when a finalizer in a former scope raises an exception.
Fix encoding error with print statements in doctests

Improved Documentation
Add documentation for the --strict flag.

Trivial/Internal Changes
Update old quotation style to parens in fixture.rst documentation.
Improve display of hint about --fulltrace with KeyboardInterrupt.
pytest„ŗ—‘ testsuite is no longer runnable through python setup.py test „ŗinstead invoke pytest or tox directly.
Fix typo in documentation

Revision 1.49 / (download) - annotate - [select for diffs], Wed Jun 6 19:27:51 2018 UTC (10 months, 2 weeks ago) by adam
Branch: MAIN
Changes since 1.48: +2 -2 lines
Diff to previous 1.48 (colored)

py-test: updated to 3.6.1

Pytest 3.6.1:
Bug Fixes
* Fixed a bug where stdout and stderr were logged twice by junitxml when a test was marked xfail.
* Fix usefixtures mark applyed to unittest tests by correctly instantiating FixtureInfo.
* Fix assertion rewriter compatibility with libraries that monkey patch file objects.

Improved Documentation
* Added a section on how to use fixtures as factories to the fixture documentation.

Trivial/Internal Changes
* Enable caching for pip/pre-commit in order to reduce build time on travis/appveyor.
* Switch pytest to the src/ layout as we already suggested it for good practice - now we implement it as well.
* Fix if in tests to support 3.7.0b5, where a docstring handling in AST got reverted.
* Remove some python2.5 compatibility code.

Revision 1.48 / (download) - annotate - [select for diffs], Wed May 30 07:35:18 2018 UTC (10 months, 3 weeks ago) by adam
Branch: MAIN
Changes since 1.47: +5 -4 lines
Diff to previous 1.47 (colored)

py-test: updated to 3.6.0

Pytest 3.6.0
Features
Revamp the internals of the pytest.mark implementation with correct per node handling which fixes a number of long standing bugs caused by the old design. This introduces new Node.iter_markers(name) and Node.get_closest_mark(name) APIs. Users are strongly encouraged to read the reasons for the revamp in the docs, or jump over to details about updating existing code to use the new APIs.
Now when @pytest.fixture is applied more than once to the same function a ValueError is raised. This buggy behavior would cause surprising problems and if was working for a test suite it was mostly by accident.
Support for Python 3.7„ŗ—‘ builtin breakpoint() method, see Using the builtin breakpoint function for details.
monkeypatch now supports a context() function which acts as a context manager which undoes all patching done within the with block.
The --pdb option now causes KeyboardInterrupt to enter the debugger, instead of stopping the test session. On python 2.7, hitting CTRL+C again exits the debugger. On python 3.2 and higher, use CTRL+D.
pytest not longer changes the log level of the root logger when the log-level parameter has greater numeric value than that of the level of the root logger, which makes it play better with custom logging configuration in user code.

Bug Fixes
A rare race-condition which might result in corrupted .pyc files on Windows has been hopefully solved.
Also use iter_marker for discovering the marks applying for marker expressions from the cli to avoid the bad data from the legacy mark storage.
When showing diffs of failed assertions where the contents contain only whitespace, escape them using repr() first to make it easy to spot the differences.

Revision 1.47 / (download) - annotate - [select for diffs], Wed Apr 25 06:57:01 2018 UTC (12 months ago) by adam
Branch: MAIN
Changes since 1.46: +2 -2 lines
Diff to previous 1.46 (colored)

py-test: updated to 3.5.1

Pytest 3.5.1:
Bug Fixes
Reset sys.last_type, sys.last_value and sys.last_traceback before each test executes. Those attributes are added by pytest during the test run to aid debugging, but were never reset so they would create a leaking reference to the last failing test„ŗ—‘ frame which in turn could never be reclaimed by the garbage collector.
pytest.raises now raises TypeError when receiving an unknown keyword argument.
pytest.raises now works with exception classes that look like iterables.

Improved Documentation
Fix typo in caplog fixture documentation, which incorrectly identified certain attributes as methods.

Trivial/Internal Changes
Added a more indicative error message when parametrizing a function whose argument takes a default value.
Remove internal _pytest.terminal.flatten function in favor of more_itertools.collapse.
Import some modules from collections.abc instead of collections as the former modules trigger DeprecationWarning in Python 3.7.
record_property is no longer experimental, removing the warnings was forgotten.
Mention in documentation and CLI help that fixtures with leading _ are printed by pytest --fixtures only if the -v option is added.

Revision 1.46 / (download) - annotate - [select for diffs], Fri Mar 23 08:58:00 2018 UTC (13 months ago) by adam
Branch: MAIN
CVS Tags: pkgsrc-2018Q1-base, pkgsrc-2018Q1
Changes since 1.45: +6 -6 lines
Diff to previous 1.45 (colored)

py-test: updated to 3.5.0

3.5.0:
Deprecations and Removals
record_xml_property fixture is now deprecated in favor of the more generic record_property.
Defining pytest_plugins is now deprecated in non-top-level conftest.py files, because they „ŗ◊Õeak„ŗto the entire directory tree.

Features
New --show-capture command-line option that allows to specify how to display captured output when tests fail: no, stdout, stderr, log or all
New --rootdir command-line option to override the rules for discovering the root directory. See customize in the documentation for details.
Fixtures are now instantiated based on their scopes, with higher-scoped fixtures
record_xml_property renamed to record_property and is now compatible with xdist, markers and any reporter. record_xml_property name is now deprecated.
New --nf, --new-first options: run new tests first followed by the rest of the tests, in both cases tests are also sorted by the file modified time, with more recent files coming first.
New --last-failed-no-failures command-line option that allows to specify the behavior of the cache plugin„ŗ—‘ `--last-failed feature when no tests failed in the last run
New --doctest-continue-on-failure command-line option to enable doctests to show multiple failures for each snippet, instead of stopping at the first failure.
Captured log messages are added to the <system-out> tag in the generated junit xml file if the junit_logging ini option is set to system-out. If the value of this ini option is system-err`, the logs are written to ``<system-err>. The default value for junit_logging is no, meaning captured logs are not written to the output file.
Allow the logging plugin to handle pytest_runtest_logstart and pytest_runtest_logfinish hooks when live logs are enabled.
Passing „ŗŇÕog-cli-level in the command-line now automatically activates live logging.
Add command line option --deselect to allow deselection of individual tests at collection time.
Captured logs are printed before entering pdb.
Deselected item count is now shown before tests are run, e.g. collected X items / Y deselected.
The builtin module platform is now available for use in expressions in pytest.mark.
The short test summary info section now is displayed after tracebacks and warnings in the terminal.
New --verbosity flag to set verbosity level explicitly.
pytest.approx now accepts comparing a numpy array with a scalar.

Bug Fixes
Suppress IOError when closing the temporary file used for capturing streams in Python 2.7.
Fixed clear() method on caplog fixture which cleared records, but not the text property.
During test collection, when stdin is not allowed to be read, the DontReadFromStdin object still allow itself to be iterable and resolved to an iterator without crashing.

Improved Documentation
Added a reference page to the docs.

Trivial/Internal Changes
Change minimum requirement of attrs to 17.4.0.
Renamed example directories so all tests pass when ran from the base directory.
Internal mark.py module has been turned into a package.
pytest now depends on the more_itertools package.
Added warning when [pytest] section is used in a .cfg file passed with -c
nodeids can now be passed explicitly to FSCollector and Node constructors.
Internal refactoring of FormattedExcinfo to use attrs facilities and remove old support code for legacy Python versions.
Refactoring to unify how verbosity is handled internally.
Internal refactoring to better integrate with argparse.
Fix a python example when calling a fixture in doc/en/usage.rst

Revision 1.45 / (download) - annotate - [select for diffs], Tue Mar 6 08:33:36 2018 UTC (13 months, 2 weeks ago) by adam
Branch: MAIN
Changes since 1.44: +2 -2 lines
Diff to previous 1.44 (colored)

py-test: updated to 3.4.2

Pytest 3.4.2:

Bug Fixes
Removed progress information when capture option is no.
Refactor check of bindir from exists to isdir.
Fix TypeError issue when using approx with a Decimal value.
Fix reference cycle generated when using the request fixture.
[tool:pytest] sections in *.cfg files passed by the -c option are now properly recognized.

Improved Documentation
Add logging plugin to plugins list.

Trivial/Internal Changes
Fix minor typo in fixture.rst

Revision 1.44 / (download) - annotate - [select for diffs], Thu Feb 22 09:34:09 2018 UTC (14 months ago) by adam
Branch: MAIN
Changes since 1.43: +2 -2 lines
Diff to previous 1.43 (colored)

py-test: updated to 3.4.1

Pytest 3.4.1

Bug Fixes
Move import of doctest.UnexpectedException to top-level to avoid possible errors when using --pdb.
Added printing of captured stdout/stderr before entering pdb, and improved a test which was giving false negatives about output capturing.
Fix ordering of tests using parametrized fixtures which can lead to fixtures being created more than necessary.
Fix bug where logging happening at hooks outside of "test run" hooks would cause an internal error.
Detect arguments injected by unittest.mock.patch decorator correctly when pypi mock.patch is installed and imported.
Errors shown when a pytest.raises() with match= fails are now cleaner on what happened: When no exception was raised, the "matching '...'" part got removed as it falsely implies that an exception was raised but it didn't match. When a wrong exception was raised, it's now thrown
Fixed output capture handling in doctests on macOS.

Improved Documentation
Add Sphinx parameter docs for match and message args to pytest.raises.

Trivial/Internal Changes
pytest has changed the publication procedure and is now being published to PyPI directly from Travis.
Rename ParameterSet._for_parameterize() to _for_parametrize() in order to comply with the naming convention.
Skip failing pdb/doctest test on mac.

Revision 1.43 / (download) - annotate - [select for diffs], Fri Feb 2 11:53:22 2018 UTC (14 months, 3 weeks ago) by adam
Branch: MAIN
Changes since 1.42: +2 -2 lines
Diff to previous 1.42 (colored)

py-test: updated to 3.4.0

Pytest 3.4.0

Deprecations and Removals
- All pytest classes now subclass object for better Python 2/3 compatibility.
  This should not affect user code except in very rare edge cases.

Features
- Introduce empty_parameter_set_mark ini option to select which mark to
  apply when @pytest.mark.parametrize is given an empty set of parameters.
  Valid options are skip (default) and xfail. Note that it is planned
  to change the default to xfail in future releases as this is considered
  less error prone.
- **Incompatible change**: after community feedback the logging
  <https://docs.pytest.org/en/latest/logging.html>_ functionality has
  undergone some changes. Please consult the logging documentation
  <https://docs.pytest.org/en/latest/logging.html#incompatible-changes-in-pytest-3-4>_
  for details.
- Console output falls back to "classic" mode when capturing is disabled (-s),
  otherwise the output gets garbled to the point of being useless.
- New pytest_runtest_logfinish
  <https://docs.pytest.org/en/latest/writing_plugins.html#_pytest.hookspec.pytest_runtest_logfinish>_
  hook which is called when a test item has finished executing, analogous to
  pytest_runtest_logstart
  <https://docs.pytest.org/en/latest/writing_plugins.html#_pytest.hookspec.pytest_runtest_start>_.
- Improve performance when collecting tests using many fixtures.
- New caplog.get_records(when) method which provides access to the captured
  records for the "setup", "call" and "teardown"
  testing stages.
- New fixture record_xml_attribute that allows modifying and inserting
  attributes on the <testcase> xml node in JUnit reports.
- The default cache directory has been renamed from .cache to
  .pytest_cache after community feedback that the name .cache did not
  make it clear that it was used by pytest.
- Colorize the levelname column in the live-log output.

Bug Fixes
- Fix hanging pexpect test on MacOS by using flush() instead of wait().
- Fix restoring Python state after in-process pytest runs with the
  pytester plugin; this may break tests using multiple inprocess
  pytest runs if later ones depend on earlier ones leaking global interpreter
  changes.
- Fix skipping plugin reporting hook when test aborted before plugin setup
  hook.
- Fix progress percentage reported when tests fail during teardown.
- **Incompatible change**: -o/--override option no longer eats all the
  remaining options, which can lead to surprising behavior: for example,
  pytest -o foo=1 /path/to/test.py would fail because /path/to/test.py
  would be considered as part of the -o command-line argument. One
  consequence of this is that now multiple configuration overrides need
  multiple -o flags: pytest -o foo=1 -o bar=2.

Revision 1.42 / (download) - annotate - [select for diffs], Fri Jan 5 15:28:37 2018 UTC (15 months, 2 weeks ago) by adam
Branch: MAIN
Changes since 1.41: +2 -2 lines
Diff to previous 1.41 (colored)

py-test: updated to 3.3.2

Pytest 3.3.2:

Bug Fixes
- pytester: ignore files used to obtain current user metadata in the fd leak
  detector.
- Fix **memory leak** where objects returned by fixtures were never destructed
  by the garbage collector.
- Fix conversion of pyargs to filename to not convert symlinks and not use
  deprecated features on Python 3.
- PYTEST_DONT_REWRITE is now checked for plugins too rather than only for
  test modules.

Improved Documentation
- Add clarifying note about behavior of multiple parametrized arguments

Trivial/Internal Changes
- Code cleanup.
- Clean up code by replacing imports and references of _ast to ast.

Revision 1.41 / (download) - annotate - [select for diffs], Wed Dec 6 11:49:14 2017 UTC (16 months, 2 weeks ago) by adam
Branch: MAIN
CVS Tags: pkgsrc-2017Q4-base, pkgsrc-2017Q4
Changes since 1.40: +2 -2 lines
Diff to previous 1.40 (colored)

py-test: updated to 3.3.1

Pytest 3.3.1:

Bug Fixes
* Fix issue about -p no:<plugin> having no effect.
* Fix regression with warnings that contained non-strings in their arguments in Python 2.
* Always escape null bytes when setting PYTEST_CURRENT_TEST.
* Fix ZeroDivisionError when using the testmon plugin when no tests were actually collected.
* Bring back TerminalReporter.writer as an alias to TerminalReporter._tw. This alias was removed by accident in the 3.3.0 release.
* The pytest-capturelog plugin is now also blacklisted, avoiding errors when running pytest with it still installed.

Improved Documentation
* Fix broken link to plugin pytest-localserver.

Revision 1.40 / (download) - annotate - [select for diffs], Tue Nov 28 09:04:56 2017 UTC (16 months, 3 weeks ago) by adam
Branch: MAIN
Changes since 1.39: +12 -4 lines
Diff to previous 1.39 (colored)

py-test: updated to 3.3.0

Pytest 3.3.0:

Deprecations and Removals
-------------------------
Pytest no longer supports Python 2.6 and 3.3. Those Python versions are EOL for some time now and incur maintenance and compatibility costs on the pytest core team, and following up with the rest of the community we decided that they will no longer be supported starting on this version. Users which still require those versions should pin pytest to <3.3.
Remove internal _preloadplugins() function. This removal is part of the pytest_namespace() hook deprecation.
Internally change CallSpec2 to have a list of marks instead of a broken mapping of keywords. This removes the keywords attribute of the internal CallSpec2 class.
Remove ParameterSet.deprecated_arg_dict - its not a public api and the lack of the underscore was a naming error.
Remove the internal multi-typed attribute Node._evalskip and replace it with the boolean Node._skipped_by_mark.

Features
--------
pytest_fixture_post_finalizer hook can now receive a request argument.
Replace the old introspection code in compat.py that determines the available arguments of fixtures with inspect.signature on Python 3 and funcsigs.signature on Python 2. This should respect __signature__ declarations on functions.
Report tests with global pytestmark variable only once.
Now pytest displays the total progress percentage while running tests. The previous output style can be set by configuring the console_output_style setting to classic.
Match warns signature to raises by adding match keyword.
Pytest now captures and displays output from the standard logging module. The user can control the logging level to be captured by specifying options in pytest.ini, the command line and also during individual tests using markers. Also, a caplog fixture is available that enables users to test the captured log during specific tests (similar to capsys for example). For more information, please see the logging docs. This feature was introduced by merging the popular pytest-catchlog plugin, thanks to Thomas Hisch. Be advised that during the merging the backward compatibility interface with the defunct pytest-capturelog has been dropped.
Add allow_module_level kwarg to pytest.skip(), enabling to skip the whole module.
Allow setting file_or_dir, -c, and -o in PYTEST_ADDOPTS.
Return stdout/stderr capture results as a namedtuple, so out and ``err`` can be accessed by attribute.
Add capfdbinary, a version of capfd which returns bytes from readouterr().
Add capsysbinary a version of capsys which returns bytes from readouterr().
Implement feature to skip setup.py files when run with --doctest-modules.

Revision 1.39 / (download) - annotate - [select for diffs], Wed Nov 15 14:14:48 2017 UTC (17 months, 1 week ago) by adam
Branch: MAIN
Changes since 1.38: +2 -2 lines
Diff to previous 1.38 (colored)

py-test: updated to 3.2.5

Pytest 3.2.5:

Bug Fixes
Remove py<1.5 restriction from pytest as this can cause version conflicts in some installations.

Revision 1.38 / (download) - annotate - [select for diffs], Wed Nov 15 07:43:41 2017 UTC (17 months, 1 week ago) by adam
Branch: MAIN
Changes since 1.37: +2 -2 lines
Diff to previous 1.37 (colored)

py-test: updated to 3.2.4

Pytest 3.2.4:
Bug Fixes
* Fix the bug where running with --pyargs will result in items with empty parent.nodeid if run from a different root directory.
* Fix issue with @pytest.parametrize if argnames was specified as keyword arguments.
* Strip whitespace from marker names when reading them from INI config.
* Show full context of doctest source in the pytest output, if the line number of failed example in the docstring is < 9

Revision 1.37 / (download) - annotate - [select for diffs], Thu Oct 5 06:54:09 2017 UTC (18 months, 2 weeks ago) by adam
Branch: MAIN
Changes since 1.36: +2 -2 lines
Diff to previous 1.36 (colored)

py-test: update to 3.2.3

Pytest 3.2.3
Bug Fixes
* Fix crash in tab completion when no prefix is given.
* The equality checking function (__eq__) of MarkDecorator returns False if one object is not an instance of MarkDecorator.
* When running pytest --fixtures-per-test: don„ŗ—’ crash if an item has no _fixtureinfo attribute (e.g. doctests)

Improved Documentation
* In help text of -k option, add example of using not to not select certain tests whose names match the provided expression.
* Add note in parametrize.rst about calling metafunc.parametrize multiple times.

Trivial/Internal Changes
* Set xfail_strict=True in pytest„ŗ—‘ own test suite to catch expected failures as soon as they start to pass.
* Fix typo in example of passing a callable to markers (in example/markers.rst)

Revision 1.36 / (download) - annotate - [select for diffs], Fri Sep 8 11:05:52 2017 UTC (19 months, 2 weeks ago) by adam
Branch: MAIN
CVS Tags: pkgsrc-2017Q3-base, pkgsrc-2017Q3, pkgsrc-
Changes since 1.35: +2 -2 lines
Diff to previous 1.35 (colored)

Pytest 3.2.2:

Bug Fixes
* Calling the deprecated request.getfuncargvalue() now shows the source of the call.
* Allow tests declared as @staticmethod to use fixtures.
* Fixed edge-case during collection: attributes which raised pytest.fail when accessed would abort the entire collection.
* Fix ReprFuncArgs with mixed unicode and UTF-8 args.

Improved Documentation
* In examples on working with custom markers, add examples demonstrating the usage of pytest.mark.MARKER_NAME.with_args in comparison with pytest.mark.MARKER_NAME.__call__
* In one of the simple examples, use pytest_collection_modifyitems() to skip tests based on a command-line option, allowing its sharing while preventing a user error when acessing pytest.config before the argument parsing.

Trivial/Internal Changes
* Fixed minor error in „ŗŌ®ood Practices/Manual Integration„ŗcode snippet.
* Fixed typo in goodpractices.rst.
* Improve user guidance regarding --resultlog deprecation.

Revision 1.35 / (download) - annotate - [select for diffs], Sun Aug 13 09:48:54 2017 UTC (20 months, 1 week ago) by adam
Branch: MAIN
Changes since 1.34: +3 -3 lines
Diff to previous 1.34 (colored)

Pytest 3.2.1
Bug Fixes:
* Fixed small terminal glitch when collecting a single test item.
* Correctly consider / as the file separator to automatically mark plugin files for rewrite on Windows.
* Properly escape test names when setting PYTEST_CURRENT_TEST environment variable.
* Fix error on Windows and Python 3.6+ when sys.stdout has been replaced with a stream-like object which does not implement the full io module buffer protocol. In particular this affects pytest-xdist users on the aforementioned platform.

Improved Documentation
* Explicitly document which pytest features work with unittest.

Revision 1.34 / (download) - annotate - [select for diffs], Thu Aug 3 07:44:11 2017 UTC (20 months, 3 weeks ago) by adam
Branch: MAIN
Changes since 1.33: +3 -3 lines
Diff to previous 1.33 (colored)

Pytest 3.2.0:
Deprecations and Removals
pytest.approx no longer supports >, >=, < and <= operators to avoid surprising/inconsistent behavior. See the docs for more information.
All old-style specific behavior in current classes in the pytest„ŗ—‘ API is considered deprecated at this point and will be removed in a future release. This affects Python 2 users only and in rare situations.
A deprecation warning is now raised when using marks for parameters in pytest.mark.parametrize. Use pytest.param to apply marks to parameters instead.

Features
Add support for numpy arrays (and dicts) to approx.
Now test function objects have a pytestmark attribute containing a list of marks applied directly to the test function, as opposed to marks inherited from parent classes or modules.
Collection ignores local virtualenvs by default; „ŗŇńollect-in-virtualenv overrides this behavior.
Allow class methods decorated as @staticmethod to be candidates for collection as a test function. (Only for Python 2.7 and above. Python 2.6 will still ignore static methods.)
Introduce mark.with_args in order to allow passing functions/classes as sole argument to marks.
New cache_dir ini option: sets the directory where the contents of the cache plugin are stored. Directory may be relative or absolute path: if relative path, then directory is created relative to rootdir, otherwise it is used as is. Additionally path may contain environment variables which are expanded during runtime.
Introduce the PYTEST_CURRENT_TEST environment variable that is set with the nodeid and stage (setup, call and teardown) of the test being currently executed. See the documentation for more info.
Introduced @pytest.mark.filterwarnings mark which allows overwriting the warnings filter on a per test, class or module level. See the docs for more information.
--last-failed now remembers forever when a test has failed and only forgets it if it passes again. This makes it easy to fix a test suite by selectively running files and fixing tests incrementally.
New pytest_report_collectionfinish hook which allows plugins to add messages to the terminal reporting after collection has been finished successfully.
Added support for PEP-415„ŗ—‘ Exception.__suppress_context__. Now if a raise exception from None is caught by pytest, pytest will no longer chain the context in the test report. The behavior now matches Python„ŗ—‘ traceback behavior.
Exceptions raised by pytest.fail, pytest.skip and pytest.xfail now subclass BaseException, making them harder to be caught unintentionally by normal code.

Bug Fixes
Set stdin to a closed PIPE in pytester.py.Testdir.popen() for avoid unwanted interactive pdb
Add missing encoding attribute to sys.std* streams when using capsys capture mode.
Fix terminal color changing to black on Windows if colorama is imported in a conftest.py file.
Fix line number when reporting summary of skipped tests.
capture: ensure that EncodedFile.name is a string.
The options --fixtures and --fixtures-per-test will now keep indentation within docstrings.
doctests line numbers are now reported correctly, fixing pytest-sugar.
Fix non-determinism in order of fixture collection. Adds new dependency (ordereddict) for Python 2.6.

Revision 1.33 / (download) - annotate - [select for diffs], Wed Jul 5 15:33:29 2017 UTC (21 months, 3 weeks ago) by adam
Branch: MAIN
Changes since 1.32: +2 -2 lines
Diff to previous 1.32 (colored)

Pytest 3.1.3:
Bug Fixes
* Fix decode error in Python 2 for doctests in docstrings.
* Exceptions raised during teardown by finalizers are now suppressed until all finalizers are called, with the initial exception reraised.
* Fix incorrect „ŗ◊ńollected items„ŗreport when specifying tests on the command- line.
deprecated_call in context-manager form now captures deprecation warnings even if the same warning has already been raised. Also, deprecated_call will always produce the same error message (previously it would produce different messages in context-manager vs. function-call mode).
* Fix issue where paths collected by pytest could have triple leading / characters.
* Fix internal error when trying to detect the start of a recursive traceback.

Improved Documentation
* Explicitly state for which hooks the calls stop after the first non-None result.

Trivial/Internal Changes
* Create invoke tasks for updating the vendored packages.
* Update copyright dates in LICENSE, README.rst and in the documentation.

Revision 1.32 / (download) - annotate - [select for diffs], Sat Jun 10 19:22:12 2017 UTC (22 months, 2 weeks ago) by adam
Branch: MAIN
CVS Tags: pkgsrc-2017Q2-base, pkgsrc-2017Q2
Changes since 1.31: +2 -2 lines
Diff to previous 1.31 (colored)

Pytest 3.1.2 (2017-06-08)
Bug Fixes
* Required options added via pytest_addoption will no longer prevent using „ŗŇ…elp without passing them.
* Respect python_files in assertion rewriting.
* Fix recursion error detection when frames in the traceback contain objects that can„ŗ—’ be compared (like numpy arrays).
* UnicodeWarning is issued from the internal pytest warnings plugin only when the message contains non-ascii unicode (Python 2 only).
* Added a workaround for Python 3.6 WindowsConsoleIO breaking due to Pytests„ŗ—‘ FDCapture. Other code using console handles might still be affected by the very same issue and might require further workarounds/fixes, i.e. colorama.

Revision 1.31 / (download) - annotate - [select for diffs], Thu Jun 1 07:14:32 2017 UTC (22 months, 3 weeks ago) by adam
Branch: MAIN
Changes since 1.30: +3 -3 lines
Diff to previous 1.30 (colored)

Pytest 3.1.1 (2017-05-30)
Bug Fixes
* pytest warning capture no longer overrides existing warning filters. The previous behaviour would override all filters and caused regressions in test suites which configure warning filters to match their needs. Note that as a side-effect of this is that DeprecationWarning and PendingDeprecationWarning are no longer shown by default.
* Fix issue with non-ascii contents in doctest text files.
* Fix encoding errors for unicode warnings in Python 2.
* pytest.deprecated_call now captures PendingDeprecationWarning in context manager form.

Improved Documentation
* Addition of towncrier for changelog management.

Revision 1.30 / (download) - annotate - [select for diffs], Sun May 28 10:44:48 2017 UTC (22 months, 4 weeks ago) by wiz
Branch: MAIN
Changes since 1.29: +2 -1 lines
Diff to previous 1.29 (colored)

Add build dependency on py-setuptools_scm.

Revision 1.29 / (download) - annotate - [select for diffs], Tue May 23 08:30:11 2017 UTC (23 months ago) by adam
Branch: MAIN
Changes since 1.28: +2 -2 lines
Diff to previous 1.28 (colored)

Chages 3.1.0:

New Features

* The ``pytest-warnings`` plugin has been integrated into the core, so now ``pytest`` automatica
lly
  captures and displays warnings at the end of the test session.

* Added ``junit_suite_name`` ini option to specify root `<testsuite>` name for JUnit XML reports

* Added an ini option ``doctest_encoding`` to specify which encoding to use for doctest files.

* ``pytest.warns`` now checks for subclass relationship rather than
  class equality.

* ``pytest.raises`` now asserts that the error message matches a text or regex
  with the ``match`` keyword argument.

* ``pytest.param`` can be used to declare test parameter sets with marks and test ids.

Revision 1.28 / (download) - annotate - [select for diffs], Mon Mar 20 13:56:18 2017 UTC (2 years, 1 month ago) by wiz
Branch: MAIN
CVS Tags: pkgsrc-2017Q1-base, pkgsrc-2017Q1
Changes since 1.27: +2 -2 lines
Diff to previous 1.27 (colored)

Updated py-test to 3.0.7.

3.0.7 (2017-03-14)
==================


* Fix issue in assertion rewriting breaking due to modules silently discarding
  other modules when importing fails
  Notably, importing the `anydbm` module is fixed. (`#2248`_).
  Thanks `@pfhayes`_ for the PR.

* junitxml: Fix problematic case where system-out tag occured twice per testcase
  element in the XML report. Thanks `@kkoukiou`_ for the PR.

* Fix regression, pytest now skips unittest correctly if run with ``--pdb``
  (`#2137`_). Thanks to `@gst`_ for the report and `@mbyt`_ for the PR.

* Ignore exceptions raised from descriptors (e.g. properties) during Python test collection (`#2234`_).
  Thanks to `@bluetech`_.

* ``--override-ini`` now correctly overrides some fundamental options like ``python_files`` (`#2238`_).
  Thanks `@sirex`_ for the report and `@nicoddemus`_ for the PR.

* Replace ``raise StopIteration`` usages in the code by simple ``returns`` to finish generators, in accordance to `PEP-479`_ (`#2160`_).
  Thanks `@tgoodlet`_ for the report and `@nicoddemus`_ for the PR.

* Fix internal errors when an unprintable ``AssertionError`` is raised inside a test.
  Thanks `@omerhadari`_ for the PR.

* Skipping plugin now also works with test items generated by custom collectors (`#2231`_).
  Thanks to `@vidartf`_.

* Fix trailing whitespace in console output if no .ini file presented (`#2281`_). Thanks `@fbjorn`_ for the PR.

* Conditionless ``xfail`` markers no longer rely on the underlying test item
  being an instance of ``PyobjMixin``, and can therefore apply to tests not
  collected by the built-in python test collector. Thanks `@barneygale`_ for the
  PR.

Revision 1.27 / (download) - annotate - [select for diffs], Sun Feb 5 19:10:30 2017 UTC (2 years, 2 months ago) by wiz
Branch: MAIN
Changes since 1.26: +2 -2 lines
Diff to previous 1.26 (colored)

Updated py-test to 3.0.6.

3.0.6 (2017-01-29)
=======================

* pytest no longer generates ``PendingDeprecationWarning`` from its own operations, which was introduced by mistake in version ``3.0.5`` (`#2118`_).
  Thanks to `@nicoddemus`_ for the report and `@RonnyPfannschmidt`_ for the PR.


* pytest no longer recognizes coroutine functions as yield tests (`#2129`_).
  Thanks to `@malinoff`_ for the PR.

* Plugins loaded by the ``PYTEST_PLUGINS`` environment variable are now automatically
  considered for assertion rewriting (`#2185`_).
  Thanks `@nicoddemus`_ for the PR.

* Improve error message when pytest.warns fails (`#2150`_). The type(s) of the
  expected warnings and the list of caught warnings is added to the
  error message. Thanks `@lesteve`_ for the PR.

* Fix ``pytester`` internal plugin to work correctly with latest versions of
  ``zope.interface`` (`#1989`_). Thanks `@nicoddemus`_ for the PR.

* Assert statements of the ``pytester`` plugin again benefit from assertion rewriting (`#1920`_).
  Thanks `@RonnyPfannschmidt`_ for the report and `@nicoddemus`_ for the PR.

* Specifying tests with colons like ``test_foo.py::test_bar`` for tests in
  subdirectories with ini configuration files now uses the correct ini file
  (`#2148`_).  Thanks `@pelme`_.

* Fail ``testdir.runpytest().assert_outcomes()`` explicitly if the pytest
  terminal output it relies on is missing. Thanks to `@eli-b`_ for the PR.

Revision 1.26 / (download) - annotate - [select for diffs], Tue Jan 3 13:23:02 2017 UTC (2 years, 3 months ago) by jperkin
Branch: MAIN
Changes since 1.25: +2 -2 lines
Diff to previous 1.25 (colored)

Use "${MV} || ${TRUE}" and "${RM} -f" consistently in post-install targets.

Revision 1.25 / (download) - annotate - [select for diffs], Mon Dec 12 14:02:20 2016 UTC (2 years, 4 months ago) by wiz
Branch: MAIN
CVS Tags: pkgsrc-2016Q4-base, pkgsrc-2016Q4
Changes since 1.24: +2 -2 lines
Diff to previous 1.24 (colored)

Updated py-test to 3.0.5.

3.0.5
=====

* Add warning when not passing ``option=value`` correctly to ``-o/--override-ini`` (`#2105`_).
  Also improved the help documentation. Thanks to `@mbukatov`_ for the report and
  `@lwm`_ for the PR.

* Now ``--confcutdir`` and ``--junit-xml`` are properly validated if they are directories
  and filenames, respectively (`#2089`_ and `#2078`_). Thanks to `@lwm`_ for the PR.

* Add hint to error message hinting possible missing ``__init__.py`` (`#478`_). Thanks `@DuncanBetts`_.

* More accurately describe when fixture finalization occurs in documentation (`#687`_). Thanks `@DuncanBetts`_.

* Provide ``:ref:`` targets for ``recwarn.rst`` so we can use intersphinx referencing.
  Thanks to `@dupuy`_ for the report and `@lwm`_ for the PR.

* In Python 2, use a simple ``+-`` ASCII string in the string representation of ``pytest.approx`` (for example ``"4 +- 4.0e-06"``)
  because it is brittle to handle that in different contexts and representations internally in pytest
  which can result in bugs such as `#2111`_. In Python 3, the representation still uses ``¬Ī`` (for example ``4 ¬Ī 4.0e-06``).
  Thanks `@kerrick-lyft`_ for the report and `@nicoddemus`_ for the PR.

* Using ``item.Function``, ``item.Module``, etc., is now issuing deprecation warnings, prefer
  ``pytest.Function``, ``pytest.Module``, etc., instead (`#2034`_).
  Thanks `@nmundar`_ for the PR.

* Fix error message using ``approx`` with complex numbers (`#2082`_).
  Thanks `@adler-j`_ for the report and `@nicoddemus`_ for the PR.

* Fixed false-positives warnings from assertion rewrite hook for modules imported more than
  once by the ``pytest_plugins`` mechanism.
  Thanks `@nicoddemus`_ for the PR.

* Remove an internal cache which could cause hooks from ``conftest.py`` files in
  sub-directories to be called in other directories incorrectly (`#2016`_).
  Thanks `@d-b-w`_ for the report and `@nicoddemus`_ for the PR.

* Remove internal code meant to support earlier Python 3 versions that produced the side effect
  of leaving ``None`` in ``sys.modules`` when expressions were evaluated by pytest (for example passing a condition
  as a string to ``pytest.mark.skipif``)(`#2103`_).
  Thanks `@jaraco`_ for the report and `@nicoddemus`_ for the PR.

* Cope gracefully with a .pyc file with no matching .py file (`#2038`_). Thanks
  `@nedbat`_.

Revision 1.24 / (download) - annotate - [select for diffs], Mon Nov 14 14:18:55 2016 UTC (2 years, 5 months ago) by wiz
Branch: MAIN
Changes since 1.23: +2 -2 lines
Diff to previous 1.23 (colored)

Updated py-test to 3.0.4.

3.0.4
=====

* Import errors when collecting test modules now display the full traceback (`#1976`_).
  Thanks `@cwitty`_ for the report and `@nicoddemus`_ for the PR.

* Fix confusing command-line help message for custom options with two or more ``metavar`` properties (`#2004`_).
  Thanks `@okulynyak`_ and `@davehunt`_ for the report and `@nicoddemus`_ for the PR.

* When loading plugins, import errors which contain non-ascii messages are now properly handled in Python 2 (`#1998`_).
  Thanks `@nicoddemus`_ for the PR.

* Fixed cyclic reference when ``pytest.raises`` is used in context-manager form (`#1965`_). Also as a
  result of this fix, ``sys.exc_info()`` is left empty in both context-manager and function call usages.
  Previously, ``sys.exc_info`` would contain the exception caught by the context manager,
  even when the expected exception occurred.
  Thanks `@MSeifert04`_ for the report and the PR.

* Fixed false-positives warnings from assertion rewrite hook for modules that were rewritten but
  were later marked explicitly by ``pytest.register_assert_rewrite``
  or implicitly as a plugin (`#2005`_).
  Thanks `@RonnyPfannschmidt`_ for the report and `@nicoddemus`_ for the PR.

* Report teardown output on test failure (`#442`_).
  Thanks `@matclab`_ or the PR.

* Fix teardown error message in generated xUnit XML.
  Thanks `@gdyuldin`_ or the PR.

* Properly handle exceptions in ``multiprocessing`` tasks (`#1984`_).
  Thanks `@adborden`_ for the report and `@nicoddemus`_ for the PR.

* Clean up unittest TestCase objects after tests are complete (`#1649`_).
  Thanks `@d_b_w`_ for the report and PR.

Revision 1.23 / (download) - annotate - [select for diffs], Wed Oct 19 13:17:10 2016 UTC (2 years, 6 months ago) by wiz
Branch: MAIN
Changes since 1.22: +2 -2 lines
Diff to previous 1.22 (colored)

Updated py-test to 3.0.3.

3.0.3
=====

* The ``ids`` argument to ``parametrize`` again accepts ``unicode`` strings
  in Python 2 (`#1905`_).
  Thanks `@philpep`_ for the report and `@nicoddemus`_ for the PR.

* Assertions are now being rewritten for plugins in development mode
  (``pip install -e``) (`#1934`_).
  Thanks `@nicoddemus`_ for the PR.

* Fix pkg_resources import error in Jython projects (`#1853`).
  Thanks `@raquel-ucl`_ for the PR.

* Got rid of ``AttributeError: 'Module' object has no attribute '_obj'`` exception
  in Python 3 (`#1944`_).
  Thanks `@axil`_ for the PR.

* Explain a bad scope value passed to ``@fixture`` declarations or
  a ``MetaFunc.parametrize()`` call. Thanks `@tgoodlet`_ for the PR.

* This version includes ``pluggy-0.4.0``, which correctly handles
  ``VersionConflict`` errors in plugins (`#704`_).
  Thanks `@nicoddemus`_ for the PR.

Revision 1.22 / (download) - annotate - [select for diffs], Sun Sep 4 09:39:09 2016 UTC (2 years, 7 months ago) by wiz
Branch: MAIN
CVS Tags: pkgsrc-2016Q3-base, pkgsrc-2016Q3
Changes since 1.21: +2 -2 lines
Diff to previous 1.21 (colored)

Updated py-test to 3.0.2.

3.0.2
=====

* Improve error message when passing non-string ids to ``pytest.mark.parametrize`` (`#1857`_).
  Thanks `@okken`_ for the report and `@nicoddemus`_ for the PR.

* Add ``buffer`` attribute to stdin stub class ``pytest.capture.DontReadFromInput``
  Thanks `@joguSD`_ for the PR.

* Fix ``UnicodeEncodeError`` when string comparison with unicode has failed. (`#1864`_)
  Thanks `@AiOO`_ for the PR.

* ``pytest_plugins`` is now handled correctly if defined as a string (as opposed as
  a sequence of strings) when modules are considered for assertion rewriting.
  Due to this bug, much more modules were being rewritten than necessary
  if a test suite uses ``pytest_plugins`` to load internal plugins (`#1888`_).
  Thanks `@jaraco`_ for the report and `@nicoddemus`_ for the PR (`#1891`_).

* Do not call tearDown and cleanups when running tests from
  ``unittest.TestCase`` subclasses with ``--pdb``
  enabled. This allows proper post mortem debugging for all applications
  which have significant logic in their tearDown machinery (`#1890`_). Thanks
  `@mbyt`_ for the PR.

* Fix use of deprecated ``getfuncargvalue`` method in the internal doctest plugin.
  Thanks `@ViviCoder`_ for the report (`#1898`_).

Revision 1.21 / (download) - annotate - [select for diffs], Wed Aug 31 09:03:45 2016 UTC (2 years, 7 months ago) by wiz
Branch: MAIN
Changes since 1.20: +2 -3 lines
Diff to previous 1.20 (colored)

Updated py-test to 3.0.1.

3.0.1
=====

* Fix regression when ``importorskip`` is used at module level (`#1822`_).
  Thanks `@jaraco`_ and `@The-Compiler`_ for the report and `@nicoddemus`_ for the PR.

* Fix parametrization scope when session fixtures are used in conjunction
  with normal parameters in the same call (`#1832`_).
  Thanks `@The-Compiler`_ for the report, `@Kingdread`_ and `@nicoddemus`_ for the PR.

* Fix internal error when parametrizing tests or fixtures using an empty ``ids`` argument (`#1849`_).
  Thanks `@OPpuolitaival`_ for the report and `@nicoddemus`_ for the PR.

* Fix loader error when running ``pytest`` embedded in a zipfile.
  Thanks `@mbachry`_ for the PR.


.. _@Kingdread: https://github.com/Kingdread
.. _@mbachry: https://github.com/mbachry
.. _@OPpuolitaival: https://github.com/OPpuolitaival

.. _#1822: https://github.com/pytest-dev/pytest/issues/1822
.. _#1832: https://github.com/pytest-dev/pytest/issues/1832
.. _#1849: https://github.com/pytest-dev/pytest/issues/1849

Revision 1.20 / (download) - annotate - [select for diffs], Sun Aug 28 15:48:31 2016 UTC (2 years, 7 months ago) by wiz
Branch: MAIN
Changes since 1.19: +1 -4 lines
Diff to previous 1.19 (colored)

Remove unnecessary PLIST_SUBST and FILES_SUBST that are now provided
by the infrastructure.

Mark a couple more packages as not ready for python-3.x.

Revision 1.19 / (download) - annotate - [select for diffs], Wed Aug 24 21:35:12 2016 UTC (2 years, 8 months ago) by wiz
Branch: MAIN
Changes since 1.18: +2 -1 lines
Diff to previous 1.18 (colored)

Fix typo in ALTERNATIVES file. Bump PKGREVISION.

Revision 1.18 / (download) - annotate - [select for diffs], Mon Aug 22 13:26:28 2016 UTC (2 years, 8 months ago) by wiz
Branch: MAIN
Changes since 1.17: +10 -5 lines
Diff to previous 1.17 (colored)

Updated py-test to 3.0.0.

Add ALTERNATIVES file.

3.0.0
=====

**Incompatible changes**


A number of incompatible changes were made in this release, with the intent of removing features deprecated for a long
time or change existing behaviors in order to make them less surprising/more useful.

* Reinterpretation mode has now been removed.  Only plain and rewrite
  mode are available, consequently the ``--assert=reinterp`` option is
  no longer available.  Thanks `@flub`_ for the PR.

* The following deprecated commandline options were removed:

  * ``--genscript``: no longer supported;
  * ``--no-assert``: use ``--assert=plain`` instead;
  * ``--nomagic``: use ``--assert=plain`` instead;
  * ``--report``: use ``-r`` instead;

  Thanks to `@RedBeardCode`_ for the PR (`#1664`_).

* ImportErrors in plugins now are a fatal error instead of issuing a
  pytest warning (`#1479`_). Thanks to `@The-Compiler`_ for the PR.

* Removed support code for Python 3 versions < 3.3 (`#1627`_).

* Removed all ``py.test-X*`` entry points. The versioned, suffixed entry points
  were never documented and a leftover from a pre-virtualenv era. These entry
  points also created broken entry points in wheels, so removing them also
  removes a source of confusion for users (`#1632`_).
  Thanks `@obestwalter`_ for the PR.

* ``pytest.skip()`` now raises an error when used to decorate a test function,
  as opposed to its original intent (to imperatively skip a test inside a test function). Previously
  this usage would cause the entire module to be skipped (`#607`_).
  Thanks `@omarkohl`_ for the complete PR (`#1519`_).

* Exit tests if a collection error occurs. A poll indicated most users will hit CTRL-C
  anyway as soon as they see collection errors, so pytest might as well make that the default behavior (`#1421`_).
  A ``--continue-on-collection-errors`` option has been added to restore the previous behaviour.
  Thanks `@olegpidsadnyi`_ and `@omarkohl`_ for the complete PR (`#1628`_).

* Renamed the pytest ``pdb`` module (plugin) into ``debugging`` to avoid clashes with the builtin ``pdb`` module.

* Raise a helpful failure message when requesting a parametrized fixture at runtime,
  e.g. with ``request.getfixturevalue``. Previously these parameters were simply
  never defined, so a fixture decorated like ``@pytest.fixture(params=[0, 1, 2])``
  only ran once (`#460`_).
  Thanks to `@nikratio`_ for the bug report, `@RedBeardCode`_ and `@tomviner`_ for the PR.

* ``_pytest.monkeypatch.monkeypatch`` class has been renamed to ``_pytest.monkeypatch.MonkeyPatch``
  so it doesn't conflict with the ``monkeypatch`` fixture.

* ``--exitfirst / -x`` can now be overridden by a following ``--maxfail=N``
  and is just a synonym for ``--maxfail=1``.


**New Features**

* Support nose-style ``__test__`` attribute on methods of classes,
  including unittest-style Classes. If set to ``False``, the test will not be
  collected.

* New ``doctest_namespace`` fixture for injecting names into the
  namespace in which doctests run.
  Thanks `@milliams`_ for the complete PR (`#1428`_).

* New ``--doctest-report`` option available to change the output format of diffs
  when running (failing) doctests (implements `#1749`_).
  Thanks `@hartym`_ for the PR.

* New ``name`` argument to ``pytest.fixture`` decorator which allows a custom name
  for a fixture (to solve the funcarg-shadowing-fixture problem).
  Thanks `@novas0x2a`_ for the complete PR (`#1444`_).

* New ``approx()`` function for easily comparing floating-point numbers in
  tests.
  Thanks `@kalekundert`_ for the complete PR (`#1441`_).

* Ability to add global properties in the final xunit output file by accessing
  the internal ``junitxml`` plugin (experimental).
  Thanks `@tareqalayan`_ for the complete PR `#1454`_).

* New ``ExceptionInfo.match()`` method to match a regular expression on the
  string representation of an exception (`#372`_).
  Thanks `@omarkohl`_ for the complete PR (`#1502`_).

* ``__tracebackhide__`` can now also be set to a callable which then can decide
  whether to filter the traceback based on the ``ExceptionInfo`` object passed
  to it. Thanks `@The-Compiler`_ for the complete PR (`#1526`_).

* New ``pytest_make_parametrize_id(config, val)`` hook which can be used by plugins to provide
  friendly strings for custom types.
  Thanks `@palaviv`_ for the PR.

* ``capsys`` and ``capfd`` now have a ``disabled()`` context-manager method, which
  can be used to temporarily disable capture within a test.
  Thanks `@nicoddemus`_ for the PR.

* New cli flag ``--fixtures-per-test``: shows which fixtures are being used
  for each selected test item. Features doc strings of fixtures by default.
  Can also show where fixtures are defined if combined with ``-v``.
  Thanks `@hackebrot`_ for the PR.

* Introduce ``pytest`` command as recommended entry point. Note that ``py.test``
  still works and is not scheduled for removal. Closes proposal
  `#1629`_. Thanks `@obestwalter`_ and `@davehunt`_ for the complete PR
  (`#1633`_).

* New cli flags:

  + ``--setup-plan``: performs normal collection and reports
    the potential setup and teardown and does not execute any fixtures and tests;
  + ``--setup-only``: performs normal collection, executes setup and teardown of
    fixtures and reports them;
  + ``--setup-show``: performs normal test execution and additionally shows
    setup and teardown of fixtures;
  + ``--keep-duplicates``: py.test now ignores duplicated paths given in the command
    line. To retain the previous behavior where the same test could be run multiple
    times by specifying it in the command-line multiple times, pass the ``--keep-duplicates``
    argument (`#1609`_);

  Thanks `@d6e`_, `@kvas-it`_, `@sallner`_, `@ioggstream`_ and `@omarkohl`_ for the PRs.

* New CLI flag ``--override-ini``/``-o``: overrides values from the ini file.
  For example: ``"-o xfail_strict=True"``'.
  Thanks `@blueyed`_ and `@fengxx`_ for the PR.

* New hooks:

  + ``pytest_fixture_setup(fixturedef, request)``: executes fixture setup;
  + ``pytest_fixture_post_finalizer(fixturedef)``: called after the fixture's
    finalizer and has access to the fixture's result cache.

  Thanks `@d6e`_, `@sallner`_.

* Issue warnings for asserts whose test is a tuple literal. Such asserts will
  never fail because tuples are always truthy and are usually a mistake
  (see `#1562`_). Thanks `@kvas-it`_, for the PR.

* Allow passing a custom debugger class (e.g. ``--pdbcls=IPython.core.debugger:Pdb``).
  Thanks to `@anntzer`_ for the PR.


**Changes**

* Plugins now benefit from assertion rewriting.  Thanks
  `@sober7`_, `@nicoddemus`_ and `@flub`_ for the PR.

* Change ``report.outcome`` for ``xpassed`` tests to ``"passed"`` in non-strict
  mode and ``"failed"`` in strict mode. Thanks to `@hackebrot`_ for the PR
  (`#1795`_) and `@gprasad84`_ for report (`#1546`_).

* Tests marked with ``xfail(strict=False)`` (the default) now appear in
  JUnitXML reports as passing tests instead of skipped.
  Thanks to `@hackebrot`_ for the PR (`#1795`_).

* Highlight path of the file location in the error report to make it easier to copy/paste.
  Thanks `@suzaku`_ for the PR (`#1778`_).

* Fixtures marked with ``@pytest.fixture`` can now use ``yield`` statements exactly like
  those marked with the ``@pytest.yield_fixture`` decorator. This change renders
  ``@pytest.yield_fixture`` deprecated and makes ``@pytest.fixture`` with ``yield`` statements
  the preferred way to write teardown code (`#1461`_).
  Thanks `@csaftoiu`_ for bringing this to attention and `@nicoddemus`_ for the PR.

* Explicitly passed parametrize ids do not get escaped to ascii (`#1351`_).
  Thanks `@ceridwen`_ for the PR.

* Fixtures are now sorted in the error message displayed when an unknown
  fixture is declared in a test function.
  Thanks `@nicoddemus`_ for the PR.

* ``pytest_terminal_summary`` hook now receives the ``exitstatus``
  of the test session as argument. Thanks `@blueyed`_ for the PR (`#1809`_).

* Parametrize ids can accept ``None`` as specific test id, in which case the
  automatically generated id for that argument will be used.
  Thanks `@palaviv`_ for the complete PR (`#1468`_).

* The parameter to xunit-style setup/teardown methods (``setup_method``,
  ``setup_module``, etc.) is now optional and may be omitted.
  Thanks `@okken`_ for bringing this to attention and `@nicoddemus`_ for the PR.

* Improved automatic id generation selection in case of duplicate ids in
  parametrize.
  Thanks `@palaviv`_ for the complete PR (`#1474`_).

* Now pytest warnings summary is shown up by default. Added a new flag
  ``--disable-pytest-warnings`` to explicitly disable the warnings summary (`#1668`_).

* Make ImportError during collection more explicit by reminding
  the user to check the name of the test module/package(s) (`#1426`_).
  Thanks `@omarkohl`_ for the complete PR (`#1520`_).

* Add ``build/`` and ``dist/`` to the default ``--norecursedirs`` list. Thanks
  `@mikofski`_ for the report and `@tomviner`_ for the PR (`#1544`_).

* ``pytest.raises`` in the context manager form accepts a custom
  ``message`` to raise when no exception occurred.
  Thanks `@palaviv`_ for the complete PR (`#1616`_).

* ``conftest.py`` files now benefit from assertion rewriting; previously it
  was only available for test modules. Thanks `@flub`_, `@sober7`_ and
  `@nicoddemus`_ for the PR (`#1619`_).

* Text documents without any doctests no longer appear as "skipped".
  Thanks `@graingert`_ for reporting and providing a full PR (`#1580`_).

* Ensure that a module within a namespace package can be found when it
  is specified on the command line together with the ``--pyargs``
  option.  Thanks to `@taschini`_ for the PR (`#1597`_).

* Always include full assertion explanation during assertion rewriting. The previous behaviour was hiding
  sub-expressions that happened to be ``False``, assuming this was redundant information.
  Thanks `@bagerard`_ for reporting (`#1503`_). Thanks to `@davehunt`_ and
  `@tomviner`_ for the PR.

* ``OptionGroup.addoption()`` now checks if option names were already
  added before, to make it easier to track down issues like `#1618`_.
  Before, you only got exceptions later from ``argparse`` library,
  giving no clue about the actual reason for double-added options.

* ``yield``-based tests are considered deprecated and will be removed in pytest-4.0.
  Thanks `@nicoddemus`_ for the PR.

* ``[pytest]`` sections in ``setup.cfg`` files should now be named ``[tool:pytest]``
  to avoid conflicts with other distutils commands (see `#567`_). ``[pytest]`` sections in
  ``pytest.ini`` or ``tox.ini`` files are supported and unchanged.
  Thanks `@nicoddemus`_ for the PR.

* Using ``pytest_funcarg__`` prefix to declare fixtures is considered deprecated and will be
  removed in pytest-4.0 (`#1684`_).
  Thanks `@nicoddemus`_ for the PR.

* Raise helpful failure message, when requesting parametrized fixture at runtime,
  e.g. with ``request.getfuncargvalue``. BACKWARD INCOMPAT: Previously these params
  were simply never defined. So a fixture decorated like ``@pytest.fixture(params=[0, 1, 2])``
  only ran once. Now a failure is raised. Fixes (`#460`_). Thanks to
  `@nikratio`_ for bug report, `@RedBeardCode`_ and `@tomviner`_ for the PR.

* Passing a command-line string to ``pytest.main()`` is considered deprecated and scheduled
  for removal in pytest-4.0. It is recommended to pass a list of arguments instead (`#1723`_).

* Rename ``getfuncargvalue`` to ``getfixturevalue``. ``getfuncargvalue`` is
  still present but is now considered deprecated. Thanks to `@RedBeardCode`_ and `@tomviner`_
  for the PR (`#1626`_).

* ``optparse`` type usage now triggers DeprecationWarnings (`#1740`_).


* ``optparse`` backward compatibility supports float/complex types (`#457`_).

* Refined logic for determining the ``rootdir``, considering only valid
  paths which fixes a number of issues: `#1594`_, `#1435`_ and `#1471`_.
  Thanks to `@blueyed`_ and `@davehunt`_ for the PR.

* Always include full assertion explanation. The previous behaviour was hiding
  sub-expressions that happened to be False, assuming this was redundant information.
  Thanks `@bagerard`_ for reporting (`#1503`_). Thanks to `@davehunt`_ and
  `@tomviner`_ for PR.

* Renamed the pytest ``pdb`` module (plugin) into ``debugging``.

* Better message in case of not using parametrized variable (see `#1539`_).
  Thanks to `@tramwaj29`_ for the PR.

* Updated docstrings with a more uniform style.

* Add stderr write for ``pytest.exit(msg)`` during startup. Previously the message was never shown.
  Thanks `@BeyondEvil`_ for reporting `#1210`_. Thanks to `@JonathonSonesen`_ and
  `@tomviner`_ for the PR.

* No longer display the incorrect test deselection reason (`#1372`_).
  Thanks `@ronnypfannschmidt`_ for the PR.

* The ``--resultlog`` command line option has been deprecated: it is little used
  and there are more modern and better alternatives (see `#830`_).
  Thanks `@nicoddemus`_ for the PR.

* Improve error message with fixture lookup errors: add an 'E' to the first
  line and '>' to the rest. Fixes `#717`_. Thanks `@blueyed`_ for reporting and
  a PR, `@eolo999`_ for the initial PR and `@tomviner`_ for his guidance during
  EuroPython2016 sprint.


**Bug Fixes**

* Parametrize now correctly handles duplicated test ids.

* Fix internal error issue when the ``method`` argument is missing for
  ``teardown_method()`` (`#1605`_).

* Fix exception visualization in case the current working directory (CWD) gets
  deleted during testing (`#1235`_). Thanks `@bukzor`_ for reporting. PR by
  `@marscher`_.

* Improve test output for logical expression with brackets (`#925`_).
  Thanks `@DRMacIver`_ for reporting and `@RedBeardCode`_ for the PR.

* Create correct diff for strings ending with newlines (`#1553`_).
  Thanks `@Vogtinator`_ for reporting and `@RedBeardCode`_ and
  `@tomviner`_ for the PR.

* ``ConftestImportFailure`` now shows the traceback making it easier to
  identify bugs in ``conftest.py`` files (`#1516`_). Thanks `@txomon`_ for
  the PR.

* Add an 'E' to the first line of error messages from FixtureLookupErrorRepr.
  Fixes `#717`_. Thanks `@blueyed`_ for reporting, `@eolo999`_ for the PR
  and `@tomviner`_ for his guidance during EuroPython2016 sprint.

* Text documents without any doctests no longer appear as "skipped".
  Thanks `@graingert`_ for reporting and providing a full PR (`#1580`_).

* Fixed collection of classes with custom ``__new__`` method.
  Fixes `#1579`_. Thanks to `@Stranger6667`_ for the PR.

* Fixed scope overriding inside metafunc.parametrize (`#634`_).
  Thanks to `@Stranger6667`_ for the PR.

* Fixed the total tests tally in junit xml output (`#1798`_).
  Thanks to `@cryporchild`_ for the PR.

* Fixed off-by-one error with lines from ``request.node.warn``.
  Thanks to `@blueyed`_ for the PR.

Revision 1.17 / (download) - annotate - [select for diffs], Mon Jun 6 12:12:55 2016 UTC (2 years, 10 months ago) by wiz
Branch: MAIN
CVS Tags: pkgsrc-2016Q2-base, pkgsrc-2016Q2
Changes since 1.16: +2 -2 lines
Diff to previous 1.16 (colored)

Updated py-test to 2.9.2.

2.9.2
=====

**Bug Fixes**

* fix `#510`_: skip tests where one parameterize dimension was empty
  thanks Alex Stapleton for the Report and `@RonnyPfannschmidt`_ for the PR

* Fix Xfail does not work with condition keyword argument.
  Thanks `@astraw38`_ for reporting the issue (`#1496`_) and `@tomviner`_
  for PR the (`#1524`_).

* Fix win32 path issue when puttinging custom config file with absolute path
  in ``pytest.main("-c your_absolute_path")``.

* Fix maximum recursion depth detection when raised error class is not aware
  of unicode/encoded bytes.
  Thanks `@prusse-martin`_ for the PR (`#1506`_).

* Fix ``pytest.mark.skip`` mark when used in strict mode.
  Thanks `@pquentin`_ for the PR and `@RonnyPfannschmidt`_ for
  showing how to fix the bug.

* Minor improvements and fixes to the documentation.
  Thanks `@omarkohl`_ for the PR.

* Fix ``--fixtures`` to show all fixture definitions as opposed to just
  one per fixture name.
  Thanks to `@hackebrot`_ for the PR.

.. _#510: https://github.com/pytest-dev/pytest/issues/510
.. _#1506: https://github.com/pytest-dev/pytest/pull/1506
.. _#1496: https://github.com/pytest-dev/pytest/issue/1496
.. _#1524: https://github.com/pytest-dev/pytest/issue/1524

.. _@prusse-martin: https://github.com/prusse-martin
.. _@astraw38: https://github.com/astraw38

Revision 1.16 / (download) - annotate - [select for diffs], Wed Apr 13 18:39:21 2016 UTC (3 years ago) by wiz
Branch: MAIN
Changes since 1.15: +2 -2 lines
Diff to previous 1.15 (colored)

Update py-test to 2.9.1.

2.9.1
=====

**Bug Fixes**

* Improve error message when a plugin fails to load.
  Thanks `@nicoddemus`_ for the PR.

* Fix (`#1178 <https://github.com/pytest-dev/pytest/issues/1178>`_):
  ``pytest.fail`` with non-ascii characters raises an internal pytest error.
  Thanks `@nicoddemus`_ for the PR.

* Fix (`#469`_): junit parses report.nodeid incorrectly, when params IDs
  contain ``::``. Thanks `@tomviner`_ for the PR (`#1431`_).

* Fix (`#578 <https://github.com/pytest-dev/pytest/issues/578>`_): SyntaxErrors
  containing non-ascii lines at the point of failure generated an internal
  py.test error.
  Thanks `@asottile`_ for the report and `@nicoddemus`_ for the PR.

* Fix (`#1437`_): When passing in a bytestring regex pattern to parameterize
  attempt to decode it as utf-8 ignoring errors.

* Fix (`#649`_): parametrized test nodes cannot be specified to run on the command line.


.. _#1437: https://github.com/pytest-dev/pytest/issues/1437
.. _#469: https://github.com/pytest-dev/pytest/issues/469
.. _#1431: https://github.com/pytest-dev/pytest/pull/1431
.. _#649: https://github.com/pytest-dev/pytest/issues/649

.. _@asottile: https://github.com/asottile


2.9.0
=====

**New Features**

* New ``pytest.mark.skip`` mark, which unconditionally skips marked tests.
  Thanks `@MichaelAquilina`_ for the complete PR (`#1040`_).

* ``--doctest-glob`` may now be passed multiple times in the command-line.
  Thanks `@jab`_ and `@nicoddemus`_ for the PR.

* New ``-rp`` and ``-rP`` reporting options give the summary and full output
  of passing tests, respectively. Thanks to `@codewarrior0`_ for the PR.

* ``pytest.mark.xfail`` now has a ``strict`` option, which makes ``XPASS``
  tests to fail the test suite (defaulting to ``False``). There's also a
  ``xfail_strict`` ini option that can be used to configure it project-wise.
  Thanks `@rabbbit`_ for the request and `@nicoddemus`_ for the PR (`#1355`_).

* ``Parser.addini`` now supports options of type ``bool``.
  Thanks `@nicoddemus`_ for the PR.

* New ``ALLOW_BYTES`` doctest option. This strips ``b`` prefixes from byte strings
  in doctest output (similar to ``ALLOW_UNICODE``).
  Thanks `@jaraco`_ for the request and `@nicoddemus`_ for the PR (`#1287`_).

* Give a hint on ``KeyboardInterrupt`` to use the ``--fulltrace`` option to show the errors.
  Fixes `#1366`_.
  Thanks to `@hpk42`_ for the report and `@RonnyPfannschmidt`_ for the PR.

* Catch ``IndexError`` exceptions when getting exception source location.
  Fixes a pytest internal error for dynamically generated code (fixtures and tests)
  where source lines are fake by intention.

**Changes**

* **Important**: `py.code <http://pylib.readthedocs.org/en/latest/code.html>`_ has been
  merged into the ``pytest`` repository as ``pytest._code``. This decision
  was made because ``py.code`` had very few uses outside ``pytest`` and the
  fact that it was in a different repository made it difficult to fix bugs on
  its code in a timely manner. The team hopes with this to be able to better
  refactor out and improve that code.
  This change shouldn't affect users, but it is useful to let users aware
  if they encounter any strange behavior.

  Keep in mind that the code for ``pytest._code`` is **private** and
  **experimental**, so you definitely should not import it explicitly!

  Please note that the original ``py.code`` is still available in
  `pylib <http://pylib.readthedocs.org>`_.

* ``pytest_enter_pdb`` now optionally receives the pytest config object.
  Thanks `@nicoddemus`_ for the PR.

* Removed code and documentation for Python 2.5 or lower versions,
  including removal of the obsolete ``_pytest.assertion.oldinterpret`` module.
  Thanks `@nicoddemus`_ for the PR (`#1226`_).

* Comparisons now always show up in full when ``CI`` or ``BUILD_NUMBER`` is
  found in the environment, even when ``-vv`` isn't used.
  Thanks `@The-Compiler`_ for the PR.

* ``--lf`` and ``--ff`` now support long names: ``--last-failed`` and
  ``--failed-first`` respectively.
  Thanks `@MichaelAquilina`_ for the PR.

* Added expected exceptions to ``pytest.raises`` fail message.

* Collection only displays progress ("collecting X items") when in a terminal.
  This avoids cluttering the output when using ``--color=yes`` to obtain
  colors in CI integrations systems (`#1397`_).

**Bug Fixes**

* The ``-s`` and ``-c`` options should now work under ``xdist``;
  ``Config.fromdictargs`` now represents its input much more faithfully.
  Thanks to `@bukzor`_ for the complete PR (`#680`_).

* Fix (`#1290`_): support Python 3.5's ``@`` operator in assertion rewriting.
  Thanks `@Shinkenjoe`_ for report with test case and `@tomviner`_ for the PR.

* Fix formatting utf-8 explanation messages (`#1379`_).
  Thanks `@biern`_ for the PR.

* Fix `traceback style docs`_ to describe all of the available options
  (auto/long/short/line/native/no), with `auto` being the default since v2.6.
  Thanks `@hackebrot`_ for the PR.

* Fix (`#1422`_): junit record_xml_property doesn't allow multiple records
  with same name.

.. _`traceback style docs`: https://pytest.org/latest/usage.html#modifying-python-traceback-printing

.. _#1422: https://github.com/pytest-dev/pytest/issues/1422
.. _#1379: https://github.com/pytest-dev/pytest/issues/1379
.. _#1366: https://github.com/pytest-dev/pytest/issues/1366
.. _#1040: https://github.com/pytest-dev/pytest/pull/1040
.. _#680: https://github.com/pytest-dev/pytest/issues/680
.. _#1287: https://github.com/pytest-dev/pytest/pull/1287
.. _#1226: https://github.com/pytest-dev/pytest/pull/1226
.. _#1290: https://github.com/pytest-dev/pytest/pull/1290
.. _#1355: https://github.com/pytest-dev/pytest/pull/1355
.. _#1397: https://github.com/pytest-dev/pytest/issues/1397
.. _@biern: https://github.com/biern
.. _@MichaelAquilina: https://github.com/MichaelAquilina
.. _@bukzor: https://github.com/bukzor
.. _@hpk42: https://github.com/hpk42
.. _@nicoddemus: https://github.com/nicoddemus
.. _@jab: https://github.com/jab
.. _@codewarrior0: https://github.com/codewarrior0
.. _@jaraco: https://github.com/jaraco
.. _@The-Compiler: https://github.com/The-Compiler
.. _@Shinkenjoe: https://github.com/Shinkenjoe
.. _@tomviner: https://github.com/tomviner
.. _@RonnyPfannschmidt: https://github.com/RonnyPfannschmidt
.. _@rabbbit: https://github.com/rabbbit
.. _@hackebrot: https://github.com/hackebrot

Revision 1.15 / (download) - annotate - [select for diffs], Mon Feb 1 13:03:45 2016 UTC (3 years, 2 months ago) by wiz
Branch: MAIN
CVS Tags: pkgsrc-2016Q1-base, pkgsrc-2016Q1
Changes since 1.14: +2 -2 lines
Diff to previous 1.14 (colored)

Update py-test to 2.8.7. All self-tests pass.

2.8.7
----------

- fix #1338: use predictable object resolution for monkeypatch

Revision 1.14 / (download) - annotate - [select for diffs], Wed Jan 27 08:58:21 2016 UTC (3 years, 2 months ago) by wiz
Branch: MAIN
Changes since 1.13: +2 -2 lines
Diff to previous 1.13 (colored)

Update py-test to 2.8.6:

2.8.6
-----

- fix #1259: allow for double nodeids in junitxml,
  this was a regression failing plugins combinations
  like pytest-pep8 + pytest-flakes

- Workaround for exception that occurs in pyreadline when using
  ``--pdb`` with standard I/O capture enabled.
  Thanks Erik M. Bray for the PR.

- fix #900: Better error message in case the target of a ``monkeypatch`` call
  raises an ``ImportError``.

- fix #1292: monkeypatch calls (setattr, setenv, etc.) are now O(1).
  Thanks David R. MacIver for the report and Bruno Oliveira for the PR.

- fix #1223: captured stdout and stderr are now properly displayed before
  entering pdb when ``--pdb`` is used instead of being thrown away.
  Thanks Cal Leeming for the PR.

- fix #1305: pytest warnings emitted during ``pytest_terminal_summary`` are now
  properly displayed.
  Thanks Ionel Maries Cristian for the report and Bruno Oliveira for the PR.

- fix #628: fixed internal UnicodeDecodeError when doctests contain unicode.
  Thanks Jason R. Coombs for the report and Bruno Oliveira for the PR.

- fix #1334: Add captured stdout to jUnit XML report on setup error.
  Thanks Georgy Dyuldin for the PR.


2.8.5
-----

- fix #1243: fixed issue where class attributes injected during collection could break pytest.
  PR by Alexei Kozlenok, thanks Ronny Pfannschmidt and Bruno Oliveira for the review and help.

- fix #1074: precompute junitxml chunks instead of storing the whole tree in objects
  Thanks Bruno Oliveira for the report and Ronny Pfannschmidt for the PR

- fix #1238: fix ``pytest.deprecated_call()`` receiving multiple arguments
  (Regression introduced in 2.8.4). Thanks Alex Gaynor for the report and
  Bruno Oliveira for the PR.


2.8.4
-----

- fix #1190: ``deprecated_call()`` now works when the deprecated
  function has been already called by another test in the same
  module. Thanks Mikhail Chernykh for the report and Bruno Oliveira for the
  PR.

- fix #1198: ``--pastebin`` option now works on Python 3. Thanks
  Mehdy Khoshnoody for the PR.

- fix #1219: ``--pastebin`` now works correctly when captured output contains
  non-ascii characters. Thanks Bruno Oliveira for the PR.

- fix #1204: another error when collecting with a nasty __getattr__().
  Thanks Florian Bruhin for the PR.

- fix the summary printed when no tests did run.
  Thanks Florian Bruhin for the PR.
- fix #1185 - ensure MANIFEST.in exactly matches what should go to a sdist

- a number of documentation modernizations wrt good practices.
  Thanks Bruno Oliveira for the PR.

Revision 1.13 / (download) - annotate - [select for diffs], Mon Nov 23 00:03:35 2015 UTC (3 years, 5 months ago) by wiz
Branch: MAIN
CVS Tags: pkgsrc-2015Q4-base, pkgsrc-2015Q4
Changes since 1.12: +2 -2 lines
Diff to previous 1.12 (colored)

Update py-test to 2.8.3.

All tests pass.


2.8.3
-----

- fix #1169: add __name__ attribute to testcases in TestCaseFunction to
  support the @unittest.skip decorator on functions and methods.
  Thanks Lee Kamentsky for the PR.

- fix #1035: collecting tests if test module level obj has __getattr__().
  Thanks Suor for the report and Bruno Oliveira / Tom Viner for the PR.

- fix #331: don't collect tests if their failure cannot be reported correctly
  e.g. they are a callable instance of a class.

- fix #1133: fixed internal error when filtering tracebacks where one entry
  belongs to a file which is no longer available.
  Thanks Bruno Oliveira for the PR.

- enhancement made to highlight in red the name of the failing tests so
  they stand out in the output.
  Thanks Gabriel Reis for the PR.

- add more talks to the documentation
- extend documentation on the --ignore cli option
- use pytest-runner for setuptools integration
- minor fixes for interaction with OS X El Capitan
  system integrity protection (thanks Florian)

Revision 1.12 / (download) - annotate - [select for diffs], Mon Oct 19 09:44:10 2015 UTC (3 years, 6 months ago) by wiz
Branch: MAIN
Changes since 1.11: +3 -3 lines
Diff to previous 1.11 (colored)

Update py-test to 2.8.2:

2.8.2
-----

- fix #1085: proper handling of encoding errors when passing encoded byte
  strings to pytest.parametrize in Python 2.
  Thanks Themanwithoutaplan for the report and Bruno Oliveira for the PR.

- fix #1087: handling SystemError when passing empty byte strings to
  pytest.parametrize in Python 3.
  Thanks Paul Kehrer for the report and Bruno Oliveira for the PR.

- fix #995: fixed internal error when filtering tracebacks where one entry
  was generated by an exec() statement.
  Thanks Daniel Hahler, Ashley C Straw, Philippe Gauthier and Pavel Savchenko
  for contributing and Bruno Oliveira for the PR.

2.8.1
-----

- fix #1034: Add missing nodeid on pytest_logwarning call in
  addhook.  Thanks Simon Gomizelj for the PR.

- 'deprecated_call' is now only satisfied with a DeprecationWarning or
  PendingDeprecationWarning. Before 2.8.0, it accepted any warning, and 2.8.0
  made it accept only DeprecationWarning (but not PendingDeprecationWarning).
  Thanks Alex Gaynor for the issue and Eric Hunsberger for the PR.

- fix issue #1073: avoid calling __getattr__ on potential plugin objects.
  This fixes an incompatibility with pytest-django.  Thanks Andreas Pelme,
  Bruno Oliveira and Ronny Pfannschmidt for contributing and Holger Krekel
  for the fix.

- Fix issue #704: handle versionconflict during plugin loading more
  gracefully.  Thanks Bruno Oliveira for the PR.

- Fix issue #1064: ""--junitxml" regression when used with the
  "pytest-xdist" plugin, with test reports being assigned to the wrong tests.
  Thanks Daniel Grunwald for the report and Bruno Oliveira for the PR.

- (experimental) adapt more SEMVER style versioning and change meaning of
  master branch in git repo: "master" branch now keeps the bugfixes, changes
  aimed for micro releases.  "features" branch will only be be released
  with minor or major pytest releases.

- Fix issue #766 by removing documentation references to distutils.
  Thanks Russel Winder.

- Fix issue #1030: now byte-strings are escaped to produce item node ids
  to make them always serializable.
  Thanks Andy Freeland for the report and Bruno Oliveira for the PR.

- Python 2: if unicode parametrized values are convertible to ascii, their
  ascii representation is used for the node id.

- Fix issue #411: Add __eq__ method to assertion comparison example.
  Thanks Ben Webb.

- fix issue 877: properly handle assertion explanations with non-ascii repr
  Thanks Mathieu Agopian for the report and Ronny Pfannschmidt for the PR.

- fix issue 1029: transform errors when writing cache values into pytest-warnings

2.8.0
-----------------------------

- new ``--lf`` and ``-ff`` options to run only the last failing tests or
  "failing tests first" from the last run.  This functionality is provided
  through porting the formerly external pytest-cache plugin into pytest core.
  BACKWARD INCOMPAT: if you used pytest-cache's functionality to persist
  data between test runs be aware that we don't serialize sets anymore.
  Thanks Ronny Pfannschmidt for most of the merging work.

- "-r" option now accepts "a" to include all possible reports, similar
  to passing "fEsxXw" explicitly (isse960).
  Thanks Abhijeet Kasurde for the PR.

- avoid python3.5 deprecation warnings by introducing version
  specific inspection helpers, thanks Michael Droettboom.

- fix issue562: @nose.tools.istest now fully respected.

- fix issue934: when string comparison fails and a diff is too large to display
  without passing -vv, still show a few lines of the diff.
  Thanks Florian Bruhin for the report and Bruno Oliveira for the PR.

- fix issue736: Fix a bug where fixture params would be discarded when combined
  with parametrization markers.
  Thanks to Markus Unterwaditzer for the PR.

- fix issue710: introduce ALLOW_UNICODE doctest option: when enabled, the
  ``u`` prefix is stripped from unicode strings in expected doctest output. This
  allows doctests which use unicode to run in Python 2 and 3 unchanged.
  Thanks Jason R. Coombs for the report and Bruno Oliveira for the PR.

- parametrize now also generates meaningful test IDs for enum, regex and class
  objects (as opposed to class instances).
  Thanks to Florian Bruhin for the PR.

- Add 'warns' to assert that warnings are thrown (like 'raises').
  Thanks to Eric Hunsberger for the PR.

- Fix issue683: Do not apply an already applied mark.  Thanks ojake for the PR.

- Deal with capturing failures better so fewer exceptions get lost to
  /dev/null.  Thanks David Szotten for the PR.

- fix issue730: deprecate and warn about the --genscript option.
  Thanks Ronny Pfannschmidt for the report and Christian Pommranz for the PR.

- fix issue751: multiple parametrize with ids bug if it parametrizes class with
  two or more test methods. Thanks Sergey Chipiga for reporting and Jan
  Bednarik for PR.

- fix issue82: avoid loading conftest files from setup.cfg/pytest.ini/tox.ini
  files and upwards by default (--confcutdir can still be set to override this).
  Thanks Bruno Oliveira for the PR.

- fix issue768: docstrings found in python modules were not setting up session
  fixtures. Thanks Jason R. Coombs for reporting and Bruno Oliveira for the PR.

- added `tmpdir_factory`, a session-scoped fixture that can be used to create
  directories under the base temporary directory. Previously this object was
  installed as a `_tmpdirhandler` attribute of the `config` object, but now it
  is part of the official API and using `config._tmpdirhandler` is
  deprecated.
  Thanks Bruno Oliveira for the PR.

- fix issue808: pytest's internal assertion rewrite hook now implements the
  optional PEP302 get_data API so tests can access data files next to them.
  Thanks xmo-odoo for request and example and Bruno Oliveira for
  the PR.

- rootdir and inifile are now displayed during usage errors to help
  users diagnose problems such as unexpected ini files which add
  unknown options being picked up by pytest. Thanks to Pavel Savchenko for
  bringing the problem to attention in #821 and Bruno Oliveira for the PR.

- Summary bar now is colored yellow for warning
  situations such as: all tests either were skipped or xpass/xfailed,
  or no tests were run at all (this is a partial fix for issue500).

- fix issue812: pytest now exits with status code 5 in situations where no
  tests were run at all, such as the directory given in the command line does
  not contain any tests or as result of a command line option filters
  all out all tests (-k for example).
  Thanks Eric Siegerman (issue812) and Bruno Oliveira for the PR.

- Summary bar now is colored yellow for warning
  situations such as: all tests either were skipped or xpass/xfailed,
  or no tests were run at all (related to issue500).
  Thanks Eric Siegerman.

- New `testpaths` ini option: list of directories to search for tests
  when executing pytest from the root directory. This can be used
  to speed up test collection when a project has well specified directories
  for tests, being usually more practical than configuring norecursedirs for
  all directories that do not contain tests.
  Thanks to Adrian for idea (#694) and Bruno Oliveira for the PR.

- fix issue713: JUnit XML reports for doctest failures.
  Thanks Punyashloka Biswal.

- fix issue970: internal pytest warnings now appear as "pytest-warnings" in
  the terminal instead of "warnings", so it is clear for users that those
  warnings are from pytest and not from the builtin "warnings" module.
  Thanks Bruno Oliveira.

- Include setup and teardown in junitxml test durations.
  Thanks Janne Vanhala.

- fix issue735: assertion failures on debug versions of Python 3.4+

- new option ``--import-mode`` to allow to change test module importing
  behaviour to append to sys.path instead of prepending.  This better allows
  to run test modules against installated versions of a package even if the
  package under test has the same import root.  In this example::

        testing/__init__.py
        testing/test_pkg_under_test.py
        pkg_under_test/

  the tests will run against the installed version
  of pkg_under_test when ``--import-mode=append`` is used whereas
  by default they would always pick up the local version.  Thanks Holger Krekel.

- pytester: add method ``TmpTestdir.delete_loaded_modules()``, and call it
  from ``inline_run()`` to allow temporary modules to be reloaded.
  Thanks Eduardo Schettino.

- internally refactor pluginmanager API and code so that there
  is a clear distinction between a pytest-agnostic rather simple
  pluginmanager and the PytestPluginManager which adds a lot of
  behaviour, among it handling of the local conftest files.
  In terms of documented methods this is a backward compatible
  change but it might still break 3rd party plugins which relied on
  details like especially the pluginmanager.add_shutdown() API.
  Thanks Holger Krekel.

- pluginmanagement: introduce ``pytest.hookimpl`` and
  ``pytest.hookspec`` decorators for setting impl/spec
  specific parameters.  This substitutes the previous
  now deprecated use of ``pytest.mark`` which is meant to
  contain markers for test functions only.

- write/refine docs for "writing plugins" which now have their
  own page and are separate from the "using/installing plugins`` page.

- fix issue732: properly unregister plugins from any hook calling
  sites allowing to have temporary plugins during test execution.

- deprecate and warn about ``__multicall__`` argument in hook
  implementations.  Use the ``hookwrapper`` mechanism instead already
  introduced with pytest-2.7.

- speed up pytest's own test suite considerably by using inprocess
  tests by default (testrun can be modified with --runpytest=subprocess
  to create subprocesses in many places instead).  The main
  APIs to run pytest in a test is "runpytest()" or "runpytest_subprocess"
  and "runpytest_inprocess" if you need a particular way of running
  the test.  In all cases you get back a RunResult but the inprocess
  one will also have a "reprec" attribute with the recorded events/reports.

- fix monkeypatch.setattr("x.y", raising=False) to actually not raise
  if "y" is not a pre-existing attribute. Thanks Florian Bruhin.

- fix issue741: make running output from testdir.run copy/pasteable
  Thanks Bruno Oliveira.

- add a new ``--noconftest`` argument which ignores all ``conftest.py`` files.

- add ``file`` and ``line`` attributes to JUnit-XML output.

- fix issue890: changed extension of all documentation files from ``txt`` to
  ``rst``. Thanks to Abhijeet for the PR.

- fix issue714: add ability to apply indirect=True parameter on particular argnames.
  Thanks Elizaveta239.

- fix issue890: changed extension of all documentation files from ``txt`` to
  ``rst``. Thanks to Abhijeet for the PR.

- fix issue957: "# doctest: SKIP" option will now register doctests as SKIPPED
  rather than PASSED.
  Thanks Thomas Grainger for the report and Bruno Oliveira for the PR.

- issue951: add new record_xml_property fixture, that supports logging
  additional information on xml output. Thanks David Diaz for the PR.

- issue949: paths after normal options (for example `-s`, `-v`, etc) are now
  properly used to discover `rootdir` and `ini` files.
  Thanks Peter Lauri for the report and Bruno Oliveira for the PR.

2.7.3 (compared to 2.7.2)
-----------------------------

- Allow 'dev', 'rc', or other non-integer version strings in `importorskip`.
  Thanks to Eric Hunsberger for the PR.

- fix issue856: consider --color parameter in all outputs (for example
  --fixtures). Thanks Barney Gale for the report and Bruno Oliveira for the PR.

- fix issue855: passing str objects as `plugins` argument to pytest.main
  is now interpreted as a module name to be imported and registered as a
  plugin, instead of silently having no effect.
  Thanks xmo-odoo for the report and Bruno Oliveira for the PR.

- fix issue744: fix for ast.Call changes in Python 3.5+.  Thanks
  Guido van Rossum, Matthias Bussonnier, Stefan Zimmermann and
  Thomas Kluyver.

- fix issue842: applying markers in classes no longer propagate this markers
  to superclasses which also have markers.
  Thanks xmo-odoo for the report and Bruno Oliveira for the PR.

- preserve warning functions after call to pytest.deprecated_call. Thanks
  Pieter Mulder for PR.

- fix issue854: autouse yield_fixtures defined as class members of
  unittest.TestCase subclasses now work as expected.
  Thannks xmo-odoo for the report and Bruno Oliveira for the PR.

- fix issue833: --fixtures now shows all fixtures of collected test files, instead of just the
  fixtures declared on the first one.
  Thanks Florian Bruhin for reporting and Bruno Oliveira for the PR.

- fix issue863: skipped tests now report the correct reason when a skip/xfail
  condition is met when using multiple markers.
  Thanks Raphael Pierzina for reporting and Bruno Oliveira for the PR.

- optimized tmpdir fixture initialization, which should make test sessions
  faster (specially when using pytest-xdist). The only visible effect
  is that now pytest uses a subdirectory in the $TEMP directory for all
  directories created by this fixture (defaults to $TEMP/pytest-$USER).
  Thanks Bruno Oliveira for the PR.

Revision 1.11 / (download) - annotate - [select for diffs], Wed Jul 1 09:34:49 2015 UTC (3 years, 9 months ago) by wiz
Branch: MAIN
CVS Tags: pkgsrc-2015Q3-base, pkgsrc-2015Q3
Changes since 1.10: +3 -3 lines
Diff to previous 1.10 (colored)

Update to 2.7.2:

2.7.2 (compared to 2.7.1)
-----------------------------

- fix issue767: pytest.raises value attribute does not contain the exception
  instance on Python 2.6. Thanks Eric Siegerman for providing the test
  case and Bruno Oliveira for PR.

- Automatically create directory for junitxml and results log.
  Thanks Aron Curzon.

- fix issue713: JUnit XML reports for doctest failures.
  Thanks Punyashloka Biswal.

- fix issue735: assertion failures on debug versions of Python 3.4+
  Thanks Benjamin Peterson.

- fix issue114: skipif marker reports to internal skipping plugin;
  Thanks Floris Bruynooghe for reporting and Bruno Oliveira for the PR.

- fix issue748: unittest.SkipTest reports to internal pytest unittest plugin.
  Thanks Thomas De Schampheleire for reporting and Bruno Oliveira for the PR.

- fix issue718: failed to create representation of sets containing unsortable
  elements in python 2. Thanks Edison Gustavo Muenz

- fix issue756, fix issue752 (and similar issues): depend on py-1.4.29
  which has a refined algorithm for traceback generation.

Revision 1.10 / (download) - annotate - [select for diffs], Thu May 28 07:13:14 2015 UTC (3 years, 10 months ago) by wiz
Branch: MAIN
CVS Tags: pkgsrc-2015Q2-base, pkgsrc-2015Q2
Changes since 1.9: +2 -2 lines
Diff to previous 1.9 (colored)

Update to 2.7.1:

2.7.1 (compared to 2.7.0)
-----------------------------

- fix issue731: do not get confused by the braces which may be present
  and unbalanced in an object's repr while collapsing False
  explanations.  Thanks Carl Meyer for the report and test case.

- fix issue553: properly handling inspect.getsourcelines failures in
  FixtureLookupError which would lead to to an internal error,
  obfuscating the original problem. Thanks talljosh for initial
  diagnose/patch and Bruno Oliveira for final patch.

- fix issue660: properly report scope-mismatch-access errors
  independently from ordering of fixture arguments.  Also
  avoid the pytest internal traceback which does not provide
  information to the user. Thanks Holger Krekel.

- streamlined and documented release process.  Also all versions
  (in setup.py and documentation generation) are now read
  from _pytest/__init__.py. Thanks Holger Krekel.

- fixed docs to remove the notion that yield-fixtures are experimental.
  They are here to stay :)  Thanks Bruno Oliveira.

- Support building wheels by using environment markers for the
  requirements.  Thanks Ionel Maries Cristian.

- fixed regression to 2.6.4 which surfaced e.g. in lost stdout capture printing
  when tests raised SystemExit. Thanks Holger Krekel.

- reintroduced _pytest fixture of the pytester plugin which is used
  at least by pytest-xdist.

Revision 1.9 / (download) - annotate - [select for diffs], Thu Apr 2 22:40:44 2015 UTC (4 years ago) by wiz
Branch: MAIN
Changes since 1.8: +2 -2 lines
Diff to previous 1.8 (colored)

Update to 2.7.0:

2.7.0 (compared to 2.6.4)
-----------------------------

- fix issue435: make reload() work when assert rewriting is active.
  Thanks Daniel Hahler.

- fix issue616: conftest.py files and their contained fixutres are now
  properly considered for visibility, independently from the exact
  current working directory and test arguments that are used.
  Many thanks to Eric Siegerman and his PR235 which contains
  systematic tests for conftest visibility and now passes.
  This change also introduces the concept of a ``rootdir`` which
  is printed as a new pytest header and documented in the pytest
  customize web page.

- change reporting of "diverted" tests, i.e. tests that are collected
  in one file but actually come from another (e.g. when tests in a test class
  come from a base class in a different file).  We now show the nodeid
  and indicate via a postfix the other file.

- add ability to set command line options by environment variable PYTEST_ADDOPTS.

- added documentation on the new pytest-dev teams on bitbucket and
  github.  See https://pytest.org/latest/contributing.html .
  Thanks to Anatoly for pushing and initial work on this.

- fix issue650: new option ``--docttest-ignore-import-errors`` which
  will turn import errors in doctests into skips.  Thanks Charles Cloud
  for the complete PR.

- fix issue655: work around different ways that cause python2/3
  to leak sys.exc_info into fixtures/tests causing failures in 3rd party code

- fix issue615: assertion re-writing did not correctly escape % signs
  when formatting boolean operations, which tripped over mixing
  booleans with modulo operators.  Thanks to Tom Viner for the report,
  triaging and fix.

- implement issue351: add ability to specify parametrize ids as a callable
  to generate custom test ids.  Thanks Brianna Laugher for the idea and
  implementation.

- introduce and document new hookwrapper mechanism useful for plugins
  which want to wrap the execution of certain hooks for their purposes.
  This supersedes the undocumented ``__multicall__`` protocol which
  pytest itself and some external plugins use.  Note that pytest-2.8
  is scheduled to drop supporting the old ``__multicall__``
  and only support the hookwrapper protocol.

- majorly speed up invocation of plugin hooks

- use hookwrapper mechanism in builtin pytest plugins.

- add a doctest ini option for doctest flags, thanks Holger Peters.

- add note to docs that if you want to mark a parameter and the
  parameter is a callable, you also need to pass in a reason to disambiguate
  it from the "decorator" case.  Thanks Tom Viner.

- "python_classes" and "python_functions" options now support glob-patterns
 for test discovery, as discussed in issue600. Thanks Ldiary Translations.

- allow to override parametrized fixtures with non-parametrized ones and vice versa (bubenkoff).

- fix issue463: raise specific error for 'parameterize' misspelling (pfctdayelise).

- On failure, the ``sys.last_value``, ``sys.last_type`` and
  ``sys.last_traceback`` are set, so that a user can inspect the error
  via postmortem debugging (almarklein).

Revision 1.8 / (download) - annotate - [select for diffs], Mon Oct 27 08:44:12 2014 UTC (4 years, 5 months ago) by wiz
Branch: MAIN
CVS Tags: pkgsrc-2015Q1-base, pkgsrc-2015Q1, pkgsrc-2014Q4-base, pkgsrc-2014Q4
Changes since 1.7: +2 -2 lines
Diff to previous 1.7 (colored)

Update to 2.6.4:

2.6.4
----------

- Improve assertion failure reporting on iterables, by using ndiff and pprint.

- removed outdated japanese docs from source tree.

- docs for "pytest_addhooks" hook.  Thanks Bruno Oliveira.

- updated plugin index docs.  Thanks Bruno Oliveira.

- fix issue557: with "-k" we only allow the old style "-" for negation
  at the beginning of strings and even that is deprecated.  Use "not" instead.
  This should allow to pick parametrized tests where "-" appeared in the parameter.

- fix issue604: Escape % character in the assertion message.

- fix issue620: add explanation in the --genscript target about what
  the binary blob means. Thanks Dinu Gherman.

- fix issue614: fixed pastebin support.

Revision 1.7 / (download) - annotate - [select for diffs], Wed Oct 1 12:31:27 2014 UTC (4 years, 6 months ago) by wiz
Branch: MAIN
Changes since 1.6: +2 -2 lines
Diff to previous 1.6 (colored)

Update to 2.6.3:

2.6.3
-----------

- fix issue575: xunit-xml was reporting collection errors as failures
  instead of errors, thanks Oleg Sinyavskiy.

- fix issue582: fix setuptools example, thanks Laszlo Papp and Ronny
  Pfannschmidt.

- Fix infinite recursion bug when pickling capture.EncodedFile, thanks
  Uwe Schmitt.

- fix issue589: fix bad interaction with numpy and others when showing
  exceptions.  Check for precise "maximum recursion depth exceed" exception
  instead of presuming any RuntimeError is that one (implemented in py
  dep).  Thanks Charles Cloud for analysing the issue.

- fix conftest related fixture visibility issue: when running with a
  CWD outside a test package pytest would get fixture discovery wrong.
  Thanks to Wolfgang Schnerring for figuring out a reproducable example.

- Introduce pytest_enter_pdb hook (needed e.g. by pytest_timeout to cancel the
  timeout when interactively entering pdb).  Thanks Wolfgang Schnerring.

- check xfail/skip also with non-python function test items. Thanks
  Floris Bruynooghe.

Revision 1.6 / (download) - annotate - [select for diffs], Sun Sep 7 20:28:42 2014 UTC (4 years, 7 months ago) by wiz
Branch: MAIN
CVS Tags: pkgsrc-2014Q3-base, pkgsrc-2014Q3
Changes since 1.5: +2 -2 lines
Diff to previous 1.5 (colored)

Update to 2.6.2:

2.6.2
-----------

- Added function pytest.freeze_includes(), which makes it easy to embed
  pytest into executables using tools like cx_freeze.
  See docs for examples and rationale. Thanks Bruno Oliveira.

- Improve assertion rewriting cache invalidation precision.

- fixed issue561: adapt autouse fixture example for python3.

- fixed issue453: assertion rewriting issue with __repr__ containing
  "\n{", "\n}" and "\n~".

- fix issue560: correctly display code if an "else:" or "finally:" is
  followed by statements on the same line.

- Fix example in monkeypatch documentation, thanks t-8ch.

- fix issue572: correct tmpdir doc example for python3.

- Do not mark as universal wheel because Python 2.6 is different from
  other builds due to the extra argparse dependency.  Fixes issue566.
  Thanks sontek.

Revision 1.5 / (download) - annotate - [select for diffs], Sun Aug 10 14:46:03 2014 UTC (4 years, 8 months ago) by wiz
Branch: MAIN
Changes since 1.4: +2 -2 lines
Diff to previous 1.4 (colored)

Update to 2.6.1:

2.6.1
-----------------------------------

- No longer show line numbers in the --verbose output, the output is now
  purely the nodeid.  The line number is still shown in failure reports.
  Thanks Floris Bruynooghe.

- fix issue437 where assertion rewriting could cause pytest-xdist slaves
  to collect different tests. Thanks Bruno Oliveira.

- fix issue555: add "errors" attribute to capture-streams to satisfy
  some distutils and possibly other code accessing sys.stdout.errors.

- fix issue547 capsys/capfd also work when output capturing ("-s") is disabled.

- address issue170: allow pytest.mark.xfail(...) to specify expected exceptions via
  an optional "raises=EXC" argument where EXC can be a single exception
  or a tuple of exception classes.  Thanks David Mohr for the complete
  PR.

- fix integration of pytest with unittest.mock.patch decorator when
  it uses the "new" argument.  Thanks Nicolas Delaby for test and PR.

- fix issue with detecting conftest files if the arguments contain
  "::" node id specifications (copy pasted from "-v" output)

- fix issue544 by only removing "@NUM" at the end of "::" separated parts
  and if the part has an ".py" extension

- don't use py.std import helper, rather import things directly.
  Thanks Bruno Oliveira.

Revision 1.4 / (download) - annotate - [select for diffs], Tue Jul 22 09:49:02 2014 UTC (4 years, 9 months ago) by wiz
Branch: MAIN
Changes since 1.3: +2 -3 lines
Diff to previous 1.3 (colored)

Update to 2.6.0:

NEXT (2.6)
-----------------------------------

- Cache exceptions from fixtures according to their scope (issue 467).

- fix issue537: Avoid importing old assertion reinterpretation code by default.

- fix issue364: shorten and enhance tracebacks representation by default.
  The new "--tb=auto" option (default) will only display long tracebacks
  for the first and last entry.  You can get the old behaviour of printing
  all entries as long entries with "--tb=long".  Also short entries by
  default are now printed very similarly to "--tb=native" ones.

- fix issue514: teach assertion reinterpretation about private class attributes

- change -v output to include full node IDs of tests.  Users can copy
  a node ID from a test run, including line number, and use it as a
  positional argument in order to run only a single test.

- fix issue 475: fail early and comprehensible if calling
  pytest.raises with wrong exception type.

- fix issue516: tell in getting-started about current dependencies.

- cleanup setup.py a bit and specify supported versions. Thanks Jurko
  Gospodnetic for the PR.

- change XPASS colour to yellow rather then red when tests are run
  with -v.

- fix issue473: work around mock putting an unbound method into a class
  dict when double-patching.

- fix issue498: if a fixture finalizer fails, make sure that
  the fixture is still invalidated.

- fix issue453: the result of the pytest_assertrepr_compare hook now gets
  it's newlines escaped so that format_exception does not blow up.

- internal new warning system: pytest will now produce warnings when
  it detects oddities in your test collection or execution.
  Warnings are ultimately sent to a new pytest_logwarning hook which is
  currently only implemented by the terminal plugin which displays
  warnings in the summary line and shows more details when -rw (report on
  warnings) is specified.

- change skips into warnings for test classes with an __init__ and
  callables in test modules which look like a test but are not functions.

- fix issue436: improved finding of initial conftest files from command
  line arguments by using the result of parse_known_args rather than
  the previous flaky heuristics.  Thanks Marc Abramowitz for tests
  and initial fixing approaches in this area.

- fix issue #479: properly handle nose/unittest(2) SkipTest exceptions
  during collection/loading of test modules.  Thanks to Marc Schlaich
  for the complete PR.

- fix issue490: include pytest_load_initial_conftests in documentation
  and improve docstring.

- fix issue472: clarify that ``pytest.config.getvalue()`` cannot work
  if it's triggered ahead of command line parsing.

- merge PR123: improved integration with mock.patch decorator on tests.

- fix issue412: messing with stdout/stderr FD-level streams is now
  captured without crashes.

- fix issue483: trial/py33 works now properly.  Thanks Daniel Grana for PR.

- improve example for pytest integration with "python setup.py test"
  which now has a generic "-a" or "--pytest-args" option where you
  can pass additional options as a quoted string.  Thanks Trevor Bekolay.

- simplified internal capturing mechanism and made it more robust
  against tests or setups changing FD1/FD2, also better integrated
  now with pytest.pdb() in single tests.

- improvements to pytest's own test-suite leakage detection, courtesy of PRs
  from Marc Abramowitz

- fix issue492: avoid leak in test_writeorg.  Thanks Marc Abramowitz.

- fix issue493: don't run tests in doc directory with ``python setup.py test``
  (use tox -e doctesting for that)

- fix issue486: better reporting and handling of early conftest loading failures

- some cleanup and simplification of internal conftest handling.

- work a bit harder to break reference cycles when catching exceptions.
  Thanks Jurko Gospodnetic.

- fix issue443: fix skip examples to use proper comparison.  Thanks Alex
  Groenholm.

- support nose-style ``__test__`` attribute on modules, classes and
  functions, including unittest-style Classes.  If set to False, the
  test will not be collected.

- fix issue512: show "<notset>" for arguments which might not be set
  in monkeypatch plugin.  Improves output in documentation.

Revision 1.3 / (download) - annotate - [select for diffs], Fri Mar 21 23:58:47 2014 UTC (5 years, 1 month ago) by wiz
Branch: MAIN
CVS Tags: pkgsrc-2014Q2-base, pkgsrc-2014Q2, pkgsrc-2014Q1-base, pkgsrc-2014Q1
Changes since 1.2: +3 -2 lines
Diff to previous 1.2 (colored)

Depend on py-1.4.20. Bump PKGREVISION.

Revision 1.2 / (download) - annotate - [select for diffs], Fri Mar 21 18:26:16 2014 UTC (5 years, 1 month ago) by wiz
Branch: MAIN
Changes since 1.1: +12 -4 lines
Diff to previous 1.1 (colored)

Update to 2.5.2 (leaf package).
Add missing dependencies. Add test dependencies. Replace interpreter
path in installed file.

Changes since 2.3.5:

2.5.2
-----------------------------------

- fix issue409 -- better interoperate with cx_freeze by not
  trying to import from collections.abc which causes problems
  for py27/cx_freeze.  Thanks Wolfgang L. for reporting and tracking it down.

- fixed docs and code to use "pytest" instead of "py.test" almost everywhere.
  Thanks Jurko Gospodnetic for the complete PR.

- fix issue425: mention at end of "py.test -h" that --markers
  and --fixtures work according to specified test path (or current dir)

- fix issue413: exceptions with unicode attributes are now printed
  correctly also on python2 and with pytest-xdist runs. (the fix
  requires py-1.4.20)

- copy, cleanup and integrate py.io capture
  from pylib 1.4.20.dev2 (rev 13d9af95547e)

- address issue416: clarify docs as to conftest.py loading semantics

- fix issue429: comparing byte strings with non-ascii chars in assert
  expressions now work better.  Thanks Floris Bruynooghe.

- make capfd/capsys.capture private, its unused and shouldnt be exposed


2.5.1
-----------------------------------

- merge new documentation styling PR from Tobias Bieniek.

- fix issue403: allow parametrize of multiple same-name functions within
  a collection node.  Thanks Andreas Kloeckner and Alex Gaynor for reporting
  and analysis.

- Allow parameterized fixtures to specify the ID of the parameters by
  adding an ids argument to pytest.fixture() and pytest.yield_fixture().
  Thanks Floris Bruynooghe.

- fix issue404 by always using the binary xml escape in the junitxml
  plugin.  Thanks Ronny Pfannschmidt.

- fix issue407: fix addoption docstring to point to argparse instead of
  optparse. Thanks Daniel D. Wright.



2.5.0
-----------------------------------

- dropped python2.5 from automated release testing of pytest itself
  which means it's probably going to break soon (but still works
  with this release we believe).

- simplified and fixed implementation for calling finalizers when
  parametrized fixtures or function arguments are involved.  finalization
  is now performed lazily at setup time instead of in the "teardown phase".
  While this might sound odd at first, it helps to ensure that we are
  correctly handling setup/teardown even in complex code.  User-level code
  should not be affected unless it's implementing the pytest_runtest_teardown
  hook and expecting certain fixture instances are torn down within (very
  unlikely and would have been unreliable anyway).

- PR90: add --color=yes|no|auto option to force terminal coloring
  mode ("auto" is default).  Thanks Marc Abramowitz.

- fix issue319 - correctly show unicode in assertion errors.  Many
  thanks to Floris Bruynooghe for the complete PR.  Also means
  we depend on py>=1.4.19 now.

- fix issue396 - correctly sort and finalize class-scoped parametrized
  tests independently from number of methods on the class.

- refix issue323 in a better way -- parametrization should now never
  cause Runtime Recursion errors because the underlying algorithm
  for re-ordering tests per-scope/per-fixture is not recursive
  anymore (it was tail-call recursive before which could lead
  to problems for more than >966 non-function scoped parameters).

- fix issue290 - there is preliminary support now for parametrizing
  with repeated same values (sometimes useful to to test if calling
  a second time works as with the first time).

- close issue240 - document precisely how pytest module importing
  works, discuss the two common test directory layouts, and how it
  interacts with PEP420-namespace packages.

- fix issue246 fix finalizer order to be LIFO on independent fixtures
  depending on a parametrized higher-than-function scoped fixture.
  (was quite some effort so please bear with the complexity of this sentence :)
  Thanks Ralph Schmitt for the precise failure example.

- fix issue244 by implementing special index for parameters to only use
  indices for paramentrized test ids

- fix issue287 by running all finalizers but saving the exception
  from the first failing finalizer and re-raising it so teardown will
  still have failed.  We reraise the first failing exception because
  it might be the cause for other finalizers to fail.

- fix ordering when mock.patch or other standard decorator-wrappings
  are used with test methods.  This fixues issue346 and should
  help with random "xdist" collection failures.  Thanks to
  Ronny Pfannschmidt and Donald Stufft for helping to isolate it.

- fix issue357 - special case "-k" expressions to allow for
  filtering with simple strings that are not valid python expressions.
  Examples: "-k 1.3" matches all tests parametrized with 1.3.
  "-k None" filters all tests that have "None" in their name
  and conversely "-k 'not None'".
  Previously these examples would raise syntax errors.

- fix issue384 by removing the trial support code
  since the unittest compat enhancements allow
  trial to handle it on its own

- don't hide an ImportError when importing a plugin produces one.
  fixes issue375.

- fix issue275 - allow usefixtures and autouse fixtures
  for running doctest text files.

- fix issue380 by making --resultlog only rely on longrepr instead
  of the "reprcrash" attribute which only exists sometimes.

- address issue122: allow @pytest.fixture(params=iterator) by exploding
  into a list early on.

- fix pexpect-3.0 compatibility for pytest's own tests.
  (fixes issue386)

- allow nested parametrize-value markers, thanks James Lan for the PR.

- fix unicode handling with new monkeypatch.setattr(import_path, value)
  API.  Thanks Rob Dennis.  Fixes issue371.

- fix unicode handling with junitxml, fixes issue368.

- In assertion rewriting mode on Python 2, fix the detection of coding
  cookies. See issue #330.

- make "--runxfail" turn imperative pytest.xfail calls into no ops
  (it already did neutralize pytest.mark.xfail markers)

- refine pytest / pkg_resources interactions: The AssertionRewritingHook
  PEP302 compliant loader now registers itself with setuptools/pkg_resources
  properly so that the pkg_resources.resource_stream method works properly.
  Fixes issue366.  Thanks for the investigations and full PR to Jason R. Coombs.

- pytestconfig fixture is now session-scoped as it is the same object during the
  whole test run.  Fixes issue370.

- avoid one surprising case of marker malfunction/confusion::

      @pytest.mark.some(lambda arg: ...)
      def test_function():

  would not work correctly because pytest assumes @pytest.mark.some
  gets a function to be decorated already.  We now at least detect if this
  arg is an lambda and thus the example will work.  Thanks Alex Gaynor
  for bringing it up.

- xfail a test on pypy that checks wrong encoding/ascii (pypy does
  not error out). fixes issue385.

- internally make varnames() deal with classes's __init__,
  although it's not needed by pytest itself atm.  Also
  fix caching.  Fixes issue376.

- fix issue221 - handle importing of namespace-package with no
  __init__.py properly.

- refactor internal FixtureRequest handling to avoid monkeypatching.
  One of the positive user-facing effects is that the "request" object
  can now be used in closures.

- fixed version comparison in pytest.importskip(modname, minverstring)

- fix issue377 by clarifying in the nose-compat docs that pytest
  does not duplicate the unittest-API into the "plain" namespace.

- fix verbose reporting for @mock'd test functions

v2.4.2
-----------------------------------

- on Windows require colorama and a newer py lib so that py.io.TerminalWriter()
  now uses colorama instead of its own ctypes hacks. (fixes issue365)
  thanks Paul Moore for bringing it up.

- fix "-k" matching of tests where "repr" and "attr" and other names would
  cause wrong matches because of an internal implementation quirk
  (don't ask) which is now properly implemented. fixes issue345.

- avoid tmpdir fixture to create too long filenames especially
  when parametrization is used (issue354)

- fix pytest-pep8 and pytest-flakes / pytest interactions
  (collection names in mark plugin was assuming an item always
  has a function which is not true for those plugins etc.)
  Thanks Andi Zeidler.

- introduce node.get_marker/node.add_marker API for plugins
  like pytest-pep8 and pytest-flakes to avoid the messy
  details of the node.keywords  pseudo-dicts.  Adapated
  docs.

- remove attempt to "dup" stdout at startup as it's icky.
  the normal capturing should catch enough possibilities
  of tests messing up standard FDs.

- add pluginmanager.do_configure(config) as a link to
  config.do_configure() for plugin-compatibility

v2.4.1
-----------------------------------

- When using parser.addoption() unicode arguments to the
  "type" keyword should also be converted to the respective types.
  thanks Floris Bruynooghe, @dnozay. (fixes issue360 and issue362)

- fix dotted filename completion when using argcomplete
  thanks Anthon van der Neuth. (fixes issue361)

- fix regression when a 1-tuple ("arg",) is used for specifying
  parametrization (the values of the parametrization were passed
  nested in a tuple).  Thanks Donald Stufft.

- merge doc typo fixes, thanks Andy Dirnberger

v2.4
-----------------------------------

known incompatibilities:

- if calling --genscript from python2.7 or above, you only get a
  standalone script which works on python2.7 or above.  Use Python2.6
  to also get a python2.5 compatible version.

- all xunit-style teardown methods (nose-style, pytest-style,
  unittest-style) will not be called if the corresponding setup method failed,
  see issue322 below.

- the pytest_plugin_unregister hook wasn't ever properly called
  and there is no known implementation of the hook - so it got removed.

- pytest.fixture-decorated functions cannot be generators (i.e. use
  yield) anymore.  This change might be reversed in 2.4.1 if it causes
  unforeseen real-life issues.  However, you can always write and return
  an inner function/generator and change the fixture consumer to iterate
  over the returned generator.  This change was done in lieu of the new
  ``pytest.yield_fixture`` decorator, see below.

new features:

- experimentally introduce a new ``pytest.yield_fixture`` decorator
  which accepts exactly the same parameters as pytest.fixture but
  mandates a ``yield`` statement instead of a ``return statement`` from
  fixture functions.  This allows direct integration with "with-style"
  context managers in fixture functions and generally avoids registering
  of finalization callbacks in favour of treating the "after-yield" as
  teardown code.  Thanks Andreas Pelme, Vladimir Keleshev, Floris
  Bruynooghe, Ronny Pfannschmidt and many others for discussions.

- allow boolean expression directly with skipif/xfail
  if a "reason" is also specified.  Rework skipping documentation
  to recommend "condition as booleans" because it prevents surprises
  when importing markers between modules.  Specifying conditions
  as strings will remain fully supported.

- reporting: color the last line red or green depending if
  failures/errors occured or everything passed.  thanks Christian
  Theunert.

- make "import pdb ; pdb.set_trace()" work natively wrt capturing (no
  "-s" needed anymore), making ``pytest.set_trace()`` a mere shortcut.

- fix issue181: --pdb now also works on collect errors (and
  on internal errors) .  This was implemented by a slight internal
  refactoring and the introduction of a new hook
  ``pytest_exception_interact`` hook (see next item).

- fix issue341: introduce new experimental hook for IDEs/terminals to
  intercept debugging: ``pytest_exception_interact(node, call, report)``.

- new monkeypatch.setattr() variant to provide a shorter
  invocation for patching out classes/functions from modules:

     monkeypatch.setattr("requests.get", myfunc)

  will replace the "get" function of the "requests" module with ``myfunc``.

- fix issue322: tearDownClass is not run if setUpClass failed. Thanks
  Mathieu Agopian for the initial fix.  Also make all of pytest/nose
  finalizer mimick the same generic behaviour: if a setupX exists and
  fails, don't run teardownX.  This internally introduces a new method
  "node.addfinalizer()" helper which can only be called during the setup
  phase of a node.

- simplify pytest.mark.parametrize() signature: allow to pass a
  CSV-separated string to specify argnames.  For example:
  ``pytest.mark.parametrize("input,expected",  [(1,2), (2,3)])``
  works as well as the previous:
  ``pytest.mark.parametrize(("input", "expected"), ...)``.

- add support for setUpModule/tearDownModule detection, thanks Brian Okken.

- integrate tab-completion on options through use of "argcomplete".
  Thanks Anthon van der Neut for the PR.

- change option names to be hyphen-separated long options but keep the
  old spelling backward compatible.  py.test -h will only show the
  hyphenated version, for example "--collect-only" but "--collectonly"
  will remain valid as well (for backward-compat reasons).  Many thanks to
  Anthon van der Neut for the implementation and to Hynek Schlawack for
  pushing us.

- fix issue 308 - allow to mark/xfail/skip individual parameter sets
  when parametrizing.  Thanks Brianna Laugher.

- call new experimental pytest_load_initial_conftests hook to allow
  3rd party plugins to do something before a conftest is loaded.

Bug fixes:

- fix issue358 - capturing options are now parsed more properly
  by using a new parser.parse_known_args method.

- pytest now uses argparse instead of optparse (thanks Anthon) which
  means that "argparse" is added as a dependency if installing into python2.6
  environments or below.

- fix issue333: fix a case of bad unittest/pytest hook interaction.

- PR27: correctly handle nose.SkipTest during collection.  Thanks
  Antonio Cuni, Ronny Pfannschmidt.

- fix issue355: junitxml puts name="pytest" attribute to testsuite tag.

- fix issue336: autouse fixture in plugins should work again.

- fix issue279: improve object comparisons on assertion failure
  for standard datatypes and recognise collections.abc.  Thanks to
  Brianna Laugher and Mathieu Agopian.

- fix issue317: assertion rewriter support for the is_package method

- fix issue335: document py.code.ExceptionInfo() object returned
  from pytest.raises(), thanks Mathieu Agopian.

- remove implicit distribute_setup support from setup.py.

- fix issue305: ignore any problems when writing pyc files.

- SO-17664702: call fixture finalizers even if the fixture function
  partially failed (finalizers would not always be called before)

- fix issue320 - fix class scope for fixtures when mixed with
  module-level functions.  Thanks Anatloy Bubenkoff.

- you can specify "-q" or "-qq" to get different levels of "quieter"
  reporting (thanks Katarzyna Jachim)

- fix issue300 - Fix order of conftest loading when starting py.test
  in a subdirectory.

- fix issue323 - sorting of many module-scoped arg parametrizations

- make sessionfinish hooks execute with the same cwd-context as at
  session start (helps fix plugin behaviour which write output files
  with relative path such as pytest-cov)

- fix issue316 - properly reference collection hooks in docs

- fix issue 306 - cleanup of -k/-m options to only match markers/test
  names/keywords respectively.  Thanks Wouter van Ackooy.

- improved doctest counting for doctests in python modules --
  files without any doctest items will not show up anymore
  and doctest examples are counted as separate test items.
  thanks Danilo Bellini.

- fix issue245 by depending on the released py-1.4.14
  which fixes py.io.dupfile to work with files with no
  mode. Thanks Jason R. Coombs.

- fix junitxml generation when test output contains control characters,
  addressing issue267, thanks Jaap Broekhuizen

- fix issue338: honor --tb style for setup/teardown errors as well.  Thanks Maho.

- fix issue307 - use yaml.safe_load in example, thanks Mark Eichin.

- better parametrize error messages, thanks Brianna Laugher

- pytest_terminal_summary(terminalreporter) hooks can now use
  ".section(title)" and ".line(msg)" methods to print extra
  information at the end of a test run.

Revision 1.1 / (download) - annotate - [select for diffs], Wed Jul 24 10:46:38 2013 UTC (5 years, 9 months ago) by drochner
Branch: MAIN
CVS Tags: pkgsrc-2013Q4-base, pkgsrc-2013Q4, pkgsrc-2013Q3-base, pkgsrc-2013Q3

add pytest-2.3.5, another Python testing framework

This form allows you to request diff's between any two revisions of a file. You may select a symbolic revision name using the selection box or you may type in a numeric name using the type-in text box.




CVSweb <webmaster@jp.NetBSD.org>